Removed Pin From Net: NetName=DO3 Pin=J2-a1
Removed Pin From Net: NetName=DO4 Pin=J2-a2
Removed Pin From Net: NetName=DO5 Pin=J2-a3
Removed Pin From Net: NetName=DO3 Pin=J2-c1
Removed Pin From Net: NetName=DO4 Pin=J2-c2
Removed Pin From Net: NetName=DO5 Pin=J2-c3
Removed Pin From Net: NetName=DO6 Pin=J3-a1
Removed Pin From Net: NetName=DO7 Pin=J3-a2
Removed Pin From Net: NetName=DO8 Pin=J3-a3
Removed Pin From Net: NetName=DO6 Pin=J3-c1
Removed Pin From Net: NetName=DO7 Pin=J3-c2
Removed Pin From Net: NetName=DO8 Pin=J3-c3
Removed Pin From Net: NetName=DO9 Pin=J4-a1
Removed Pin From Net: NetName=DO10 Pin=J4-a2
Removed Pin From Net: NetName=DO11 Pin=J4-a3
Removed Pin From Net: NetName=DO9 Pin=J4-c1
Removed Pin From Net: NetName=DO10 Pin=J4-c2
Removed Pin From Net: NetName=DO11 Pin=J4-c3
Removed Pin From Net: NetName=DO12 Pin=J5-a1
Removed Pin From Net: NetName=DO13 Pin=J5-a2
Removed Pin From Net: NetName=DO14 Pin=J5-a3
Removed Pin From Net: NetName=DO12 Pin=J5-c1
Removed Pin From Net: NetName=DO13 Pin=J5-c2
Removed Pin From Net: NetName=DO14 Pin=J5-c3
Removed Pin From Net: NetName=DO15 Pin=J6-a1
Removed Pin From Net: NetName=DO16 Pin=J6-a2
Removed Pin From Net: NetName=DO17 Pin=J6-a3
Removed Pin From Net: NetName=DO15 Pin=J6-c1
Removed Pin From Net: NetName=DO16 Pin=J6-c2
Removed Pin From Net: NetName=DO17 Pin=J6-c3
Removed Pin From Net: NetName=DO18 Pin=J7-a1
Removed Pin From Net: NetName=DO19 Pin=J7-a2
Removed Pin From Net: NetName=DO20 Pin=J7-a3
Removed Pin From Net: NetName=DO18 Pin=J7-c1
Removed Pin From Net: NetName=DO19 Pin=J7-c2
Removed Pin From Net: NetName=DO20 Pin=J7-c3
Removed Pin From Net: NetName=DO21 Pin=J8-a1
Removed Pin From Net: NetName=DO22 Pin=J8-a2
Removed Pin From Net: NetName=DO23 Pin=J8-a3
Removed Pin From Net: NetName=DO21 Pin=J8-c1
Removed Pin From Net: NetName=DO22 Pin=J8-c2
Removed Pin From Net: NetName=DO23 Pin=J8-c3
Removed Pin From Net: NetName=DO24 Pin=J9-a1
Removed Pin From Net: NetName=DO25 Pin=J9-a2
Removed Pin From Net: NetName=DO26 Pin=J9-a3
Removed Pin From Net: NetName=0V Pin=J9-a5
Removed Pin From Net: NetName=+5V Pin=J9-a30
Removed Pin From Net: NetName=GND Pin=J9-a32
Removed Pin From Net: NetName=DO24 Pin=J9-c1
Removed Pin From Net: NetName=DO25 Pin=J9-c2
Removed Pin From Net: NetName=DO26 Pin=J9-c3
Removed Pin From Net: NetName=0V Pin=J9-c5
Removed Pin From Net: NetName=+5V Pin=J9-c30
Removed Pin From Net: NetName=GND Pin=J9-c32
Removed Pin From Net: NetName=EARTH Pin=J9-MTG1
Removed Pin From Net: NetName=EARTH Pin=J9-MTG2
Removed Pin From Net: NetName=DO27 Pin=J10-a1
Removed Pin From Net: NetName=DO28 Pin=J10-a2
Removed Pin From Net: NetName=DO29 Pin=J10-a3
Removed Pin From Net: NetName=0V Pin=J10-a5
Removed Pin From Net: NetName=+5V Pin=J10-a30
Removed Pin From Net: NetName=GND Pin=J10-a32
Removed Pin From Net: NetName=DO27 Pin=J10-c1
Removed Pin From Net: NetName=DO28 Pin=J10-c2
Removed Pin From Net: NetName=DO29 Pin=J10-c3
Removed Pin From Net: NetName=0V Pin=J10-c5
Removed Pin From Net: NetName=+5V Pin=J10-c30
Removed Pin From Net: NetName=GND Pin=J10-c32
Removed Pin From Net: NetName=EARTH Pin=J10-MTG1
Removed Pin From Net: NetName=EARTH Pin=J10-MTG2
Removed Member From Class: ClassName=Overlapping Member=J9
Removed Member From Class: ClassName=VELO CAEN Backplane V1 Member=J9
Removed Member From Class: ClassName=Overlapping Member=J10
Removed Member From Class: ClassName=VELO CAEN Backplane V1 Member=J10
Removed Member From Class: ClassName=Overlapping Member=SCREW17
Removed Member From Class: ClassName=VELO CAEN Backplane V1 Member=SCREW17
Removed Member From Class: ClassName=Overlapping Member=SCREW18
Removed Member From Class: ClassName=VELO CAEN Backplane V1 Member=SCREW18
Removed Member From Class: ClassName=Overlapping Member=SCREW19
Removed Member From Class: ClassName=VELO CAEN Backplane V1 Member=SCREW19
Removed Member From Class: ClassName=Overlapping Member=SCREW20.
Removed Member From Class: ClassName=VELO CAEN Backplane V1 Member=SCREW20.
Removed Member From Class: ClassName=Overlapping Member=WASHER17
Removed Member From Class: ClassName=VELO CAEN Backplane V1 Member=WASHER17
Removed Member From Class: ClassName=Overlapping Member=WASHER18
Removed Member From Class: ClassName=VELO CAEN Backplane V1 Member=WASHER18
Removed Member From Class: ClassName=Overlapping Member=WASHER19
Removed Member From Class: ClassName=VELO CAEN Backplane V1 Member=WASHER19
Removed Member From Class: ClassName=Overlapping Member=WASHER20
Removed Member From Class: ClassName=VELO CAEN Backplane V1 Member=WASHER20
Added Pin To Net: NetName=DO3 Pin=J1-a4
Added Pin To Net: NetName=DO3 Pin=J1-c4
Added Pin To Net: NetName=DO4 Pin=J2-a1
Added Pin To Net: NetName=DO5 Pin=J2-a2
Added Pin To Net: NetName=DO6 Pin=J2-a3
Added Pin To Net: NetName=DO7 Pin=J2-a4
Added Pin To Net: NetName=DO4 Pin=J2-c1
Added Pin To Net: NetName=DO5 Pin=J2-c2
Added Pin To Net: NetName=DO6 Pin=J2-c3
Added Pin To Net: NetName=DO7 Pin=J2-c4
Added Pin To Net: NetName=DO8 Pin=J3-a1
Added Pin To Net: NetName=DO9 Pin=J3-a2
Added Pin To Net: NetName=DO10 Pin=J3-a3
Added Pin To Net: NetName=DO11 Pin=J3-a4
Added Pin To Net: NetName=DO8 Pin=J3-c1
Added Pin To Net: NetName=DO9 Pin=J3-c2
Added Pin To Net: NetName=DO10 Pin=J3-c3
Added Pin To Net: NetName=DO11 Pin=J3-c4
Added Pin To Net: NetName=DO12 Pin=J4-a1
Added Pin To Net: NetName=DO13 Pin=J4-a2
Added Pin To Net: NetName=DO14 Pin=J4-a3
Added Pin To Net: NetName=DO15 Pin=J4-a4
Added Pin To Net: NetName=DO12 Pin=J4-c1
Added Pin To Net: NetName=DO13 Pin=J4-c2
Added Pin To Net: NetName=DO14 Pin=J4-c3
Added Pin To Net: NetName=DO15 Pin=J4-c4
Added Pin To Net: NetName=DO16 Pin=J5-a1
Added Pin To Net: NetName=DO17 Pin=J5-a2
Added Pin To Net: NetName=DO18 Pin=J5-a3
Added Pin To Net: NetName=DO19 Pin=J5-a4
Added Pin To Net: NetName=DO16 Pin=J5-c1
Added Pin To Net: NetName=DO17 Pin=J5-c2
Added Pin To Net: NetName=DO18 Pin=J5-c3
Added Pin To Net: NetName=DO19 Pin=J5-c4
Added Pin To Net: NetName=DO20 Pin=J6-a1
Added Pin To Net: NetName=DO21 Pin=J6-a2
Added Pin To Net: NetName=DO22 Pin=J6-a3
Added Pin To Net: NetName=DO23 Pin=J6-a4
Added Pin To Net: NetName=DO20 Pin=J6-c1
Added Pin To Net: NetName=DO21 Pin=J6-c2
Added Pin To Net: NetName=DO22 Pin=J6-c3
Added Pin To Net: NetName=DO23 Pin=J6-c4
Added Pin To Net: NetName=DO24 Pin=J7-a1
Added Pin To Net: NetName=DO25 Pin=J7-a2
Added Pin To Net: NetName=DO26 Pin=J7-a3
Added Pin To Net: NetName=DO27 Pin=J7-a4
Added Pin To Net: NetName=DO24 Pin=J7-c1
Added Pin To Net: NetName=DO25 Pin=J7-c2
Added Pin To Net: NetName=DO26 Pin=J7-c3
Added Pin To Net: NetName=DO27 Pin=J7-c4
Added Pin To Net: NetName=DO28 Pin=J8-a1
Added Pin To Net: NetName=DO29 Pin=J8-a2
Added Pin To Net: NetName=DO30 Pin=J8-a3
Added Pin To Net: NetName=DO31 Pin=J8-a4
Added Pin To Net: NetName=DO28 Pin=J8-c1
Added Pin To Net: NetName=DO29 Pin=J8-c2
Added Pin To Net: NetName=DO30 Pin=J8-c3
Added Pin To Net: NetName=DO31 Pin=J8-c4
Change Class Name : Old Net Name=VELO CAEN Backplane V1 New Net Name=VELO ISEG Backplane V1
Change Room Name: Old Name=VELO CAEN Backplane V1 New Name=VELO ISEG Backplane V1
Change Room Scope: Old Scope=InComponentClass('VELO CAEN Backplane V1') New Scope=InComponentClass('VELO ISEG Backplane V1')
