%TF.GenerationSoftware,Altium Limited,Altium Designer,19.1.5 (86)*%
G04 Layer_Color=16711935*
%FSLAX45Y45*%
%MOMM*%
%TF.FileFunction,Other,Corners*%
%TF.Part,Single*%
G01*
G75*
%TA.AperFunction,NonConductor*%
%ADD14C,0.25400*%
D14*
X7162001Y20532001D02*
X7662000D01*
Y21032001D01*
X50190024Y20532001D02*
Y21032001D01*
Y20532001D02*
X50690021D01*
X50190024Y7661994D02*
X50690021D01*
X50190024Y7161990D02*
Y7661994D01*
X7161996D02*
X7662000D01*
Y7161995D02*
Y7661994D01*
X15367000Y5588000D02*
X16383000D01*
X15367000Y5080000D02*
X16383000D01*
X15367000D02*
Y5588000D01*
X16383000Y5080000D02*
Y5588000D01*
X15875000Y5080000D02*
Y5588000D01*
%TF.MD5,75b989bc7ac26a54de9ec5eb5f67027c*%
M02*
