Removed Pin From Net: NetName=DO_4 Pin=RL40-3
Removed Pin From Net: NetName=GNC_PLC Pin=RL40-8
Removed Member From Class: ClassName=Velo ISEG V3 Member=RL?
Change Component Designator: OldDesignator=RL? NewDesignator=RL40
Added Pin To Net: NetName=DO_4 Pin=RL40-3
Added Pin To Net: NetName=GNC_PLC Pin=RL40-8
