%TF.GenerationSoftware,Altium Limited,Altium Designer,19.1.5 (86)*%
G04 Layer_Color=255*
%FSLAX45Y45*%
%MOMM*%
%TF.FileFunction,Pads,Top*%
%TF.Part,Single*%
G01*
G75*
%TA.AperFunction,ComponentPad*%
%ADD14C,1.60000*%
%ADD15C,1.50000*%
%ADD16C,3.75000*%
%ADD17C,1.90000*%
%ADD18C,0.50000*%
%ADD19C,1.70000*%
%ADD20C,3.50000*%
%ADD21C,2.00000*%
%ADD22R,1.60000X1.60000*%
%TA.AperFunction,ViaPad*%
%ADD23C,4.45000*%
D14*
X9067800Y9906000D02*
D03*
X10083800D02*
D03*
X14859000Y9271000D02*
D03*
X14605000D02*
D03*
X15113000D02*
D03*
Y8509000D02*
D03*
X14859000D02*
D03*
Y15900400D02*
D03*
X15113000D02*
D03*
Y16662399D02*
D03*
X14605000D02*
D03*
X14859000D02*
D03*
X15113000Y17043401D02*
D03*
X14097000D02*
D03*
X14605000Y15519400D02*
D03*
X15621001D02*
D03*
X14859000Y13462000D02*
D03*
X15113000D02*
D03*
Y14224001D02*
D03*
X14605000D02*
D03*
X14859000D02*
D03*
Y10922000D02*
D03*
X15113000D02*
D03*
Y11684000D02*
D03*
X14605000D02*
D03*
X14859000D02*
D03*
X15494000Y17043401D02*
D03*
X16510001D02*
D03*
X10033000Y11430000D02*
D03*
X9017000D02*
D03*
X14605000Y13081000D02*
D03*
X15621001D02*
D03*
X15494000Y14605000D02*
D03*
X16510001D02*
D03*
X15113000D02*
D03*
X14097000D02*
D03*
X10058400Y10922000D02*
D03*
X9042400D02*
D03*
X14605000Y10541000D02*
D03*
X15621001D02*
D03*
X15494000Y12065000D02*
D03*
X16510001D02*
D03*
X15113000D02*
D03*
X14097000D02*
D03*
X10058400Y10414000D02*
D03*
X9042400D02*
D03*
X15621001Y8128000D02*
D03*
X14605000D02*
D03*
X16510001Y9652000D02*
D03*
X15494000D02*
D03*
X14097000D02*
D03*
X15113000D02*
D03*
D15*
X16510001Y8763000D02*
D03*
X16002000D02*
D03*
X17017999Y9271000D02*
D03*
Y8763000D02*
D03*
X16510001Y9271000D02*
D03*
X16002000D02*
D03*
X8382000Y9906000D02*
D03*
Y10160000D02*
D03*
Y11684000D02*
D03*
Y11430000D02*
D03*
Y11176000D02*
D03*
Y10922000D02*
D03*
Y10668000D02*
D03*
Y10414000D02*
D03*
X16002000Y16662399D02*
D03*
X16510001D02*
D03*
X17017999Y16154401D02*
D03*
Y16662399D02*
D03*
X16002000Y16154401D02*
D03*
X16510001D02*
D03*
X16002000Y14224001D02*
D03*
X16510001D02*
D03*
X17017999Y13716000D02*
D03*
Y14224001D02*
D03*
X16002000Y13716000D02*
D03*
X16510001D02*
D03*
X16002000Y11684000D02*
D03*
X16510001D02*
D03*
X17017999Y11176000D02*
D03*
Y11684000D02*
D03*
X16002000Y11176000D02*
D03*
X16510001D02*
D03*
D16*
X9055000Y15716000D02*
D03*
X8255000D02*
D03*
X9055000Y13216998D02*
D03*
X8255000D02*
D03*
D17*
X8930000Y14605000D02*
D03*
X9214000Y13912498D02*
D03*
Y14189500D02*
D03*
Y14466499D02*
D03*
Y14743500D02*
D03*
Y15020500D02*
D03*
X8930000Y14882001D02*
D03*
Y14328000D02*
D03*
Y14050999D02*
D03*
X8255000Y14605000D02*
D03*
X8539000Y13912498D02*
D03*
Y14189500D02*
D03*
Y14466499D02*
D03*
Y14743500D02*
D03*
Y15020500D02*
D03*
X8255000Y14882001D02*
D03*
Y14328000D02*
D03*
Y14050999D02*
D03*
X17399001Y9525000D02*
D03*
Y8509000D02*
D03*
Y15900400D02*
D03*
Y16916400D02*
D03*
Y13462000D02*
D03*
Y14478000D02*
D03*
Y10922000D02*
D03*
Y11938000D02*
D03*
D18*
X8128000Y10033000D02*
D03*
Y11557000D02*
D03*
Y11049000D02*
D03*
Y10541000D02*
D03*
D19*
X23113998Y16637003D02*
D03*
Y16383002D02*
D03*
Y16129002D02*
D03*
Y15875002D02*
D03*
Y15621002D02*
D03*
Y15367001D02*
D03*
Y15113002D02*
D03*
Y14859003D02*
D03*
Y12827002D02*
D03*
Y13081001D02*
D03*
Y13335002D02*
D03*
Y13589001D02*
D03*
Y13843002D02*
D03*
Y14097002D02*
D03*
Y14351003D02*
D03*
Y14605002D02*
D03*
Y10795002D02*
D03*
Y11049002D02*
D03*
Y11303002D02*
D03*
Y11557002D02*
D03*
Y11811002D02*
D03*
Y12065002D02*
D03*
Y12319002D02*
D03*
Y12573002D02*
D03*
Y8763002D02*
D03*
Y9017002D02*
D03*
Y9271002D02*
D03*
Y9525002D02*
D03*
Y9779002D02*
D03*
Y10033002D02*
D03*
Y10287002D02*
D03*
Y10541002D02*
D03*
X22606000D02*
D03*
Y10287002D02*
D03*
Y10033002D02*
D03*
Y9779002D02*
D03*
Y9525002D02*
D03*
Y9271002D02*
D03*
Y9017002D02*
D03*
Y8763002D02*
D03*
Y12573002D02*
D03*
Y12319002D02*
D03*
Y12065002D02*
D03*
Y11811002D02*
D03*
Y11557002D02*
D03*
Y11303002D02*
D03*
Y11049002D02*
D03*
Y10795002D02*
D03*
Y14605002D02*
D03*
Y14351003D02*
D03*
Y14097002D02*
D03*
Y13843002D02*
D03*
Y13589001D02*
D03*
Y13335002D02*
D03*
Y13081001D02*
D03*
Y12827002D02*
D03*
Y14859003D02*
D03*
Y15113002D02*
D03*
Y15367001D02*
D03*
Y15621002D02*
D03*
Y15875002D02*
D03*
Y16129002D02*
D03*
Y16383002D02*
D03*
Y16637003D02*
D03*
D20*
X23367999Y17145003D02*
D03*
Y8255002D02*
D03*
D21*
X21442172Y9273156D02*
D03*
X20874226Y9268844D02*
D03*
D22*
X14605000Y8509000D02*
D03*
Y15900400D02*
D03*
Y13462000D02*
D03*
Y10922000D02*
D03*
D23*
X8001000Y8255000D02*
D03*
Y17145000D02*
D03*
%TF.MD5,8b0ca809ceae58cd508000900a2ee73c*%
M02*
