%TF.GenerationSoftware,Altium Limited,Altium Designer,19.1.5 (86)*%
G04 Layer_Color=128*
%FSLAX45Y45*%
%MOMM*%
%TF.FileFunction,Drillmap*%
%TF.Part,Single*%
G01*
G75*
%TA.AperFunction,NonConductor*%
%ADD33C,0.12700*%
D33*
X9022800Y9906000D02*
X9112800D01*
X9067800Y9861000D02*
Y9951000D01*
X10038800Y9906000D02*
X10128800D01*
X10083800Y9861000D02*
Y9951000D01*
X16470000Y8763000D02*
X16550000D01*
X16510001Y8723000D02*
Y8803000D01*
X15962000Y8763000D02*
X16042000D01*
X16002000Y8723000D02*
Y8803000D01*
X16978000Y9271000D02*
X17058000D01*
X17017999Y9231000D02*
Y9311000D01*
X16978000Y8763000D02*
X17058000D01*
X17017999Y8723000D02*
Y8803000D01*
X16470000Y9271000D02*
X16550000D01*
X16510001Y9231000D02*
Y9311000D01*
X15962000Y9271000D02*
X16042000D01*
X16002000Y9231000D02*
Y9311000D01*
X8902500Y15716000D02*
X9207500D01*
X9055000Y15563501D02*
Y15868500D01*
X8102500Y15716000D02*
X8407500D01*
X8255000Y15563501D02*
Y15868500D01*
X8902500Y13216998D02*
X9207500D01*
X9055000Y13064499D02*
Y13369499D01*
X8102500Y13216998D02*
X8407500D01*
X8255000Y13064499D02*
Y13369499D01*
X8870000Y14605000D02*
X8990000D01*
X8930000Y14545000D02*
Y14664999D01*
X9154000Y13912498D02*
X9274000D01*
X9214000Y13852499D02*
Y13972499D01*
X9154000Y14189500D02*
X9274000D01*
X9214000Y14129500D02*
Y14249500D01*
X9154000Y14466499D02*
X9274000D01*
X9214000Y14406500D02*
Y14526500D01*
X9154000Y14743500D02*
X9274000D01*
X9214000Y14683501D02*
Y14803500D01*
X9154000Y15020500D02*
X9274000D01*
X9214000Y14960500D02*
Y15080499D01*
X8870000Y14882001D02*
X8990000D01*
X8930000Y14822000D02*
Y14942000D01*
X8870000Y14328000D02*
X8990000D01*
X8930000Y14267999D02*
Y14388000D01*
X8870000Y14050999D02*
X8990000D01*
X8930000Y13991000D02*
Y14110999D01*
X8195000Y14605000D02*
X8315000D01*
X8255000Y14545000D02*
Y14664999D01*
X8479000Y13912498D02*
X8599000D01*
X8539000Y13852499D02*
Y13972499D01*
X8479000Y14189500D02*
X8599000D01*
X8539000Y14129500D02*
Y14249500D01*
X8479000Y14466499D02*
X8599000D01*
X8539000Y14406500D02*
Y14526500D01*
X8479000Y14743500D02*
X8599000D01*
X8539000Y14683501D02*
Y14803500D01*
X8479000Y15020500D02*
X8599000D01*
X8539000Y14960500D02*
Y15080499D01*
X8195000Y14882001D02*
X8315000D01*
X8255000Y14822000D02*
Y14942000D01*
X8195000Y14328000D02*
X8315000D01*
X8255000Y14267999D02*
Y14388000D01*
X8195000Y14050999D02*
X8315000D01*
X8255000Y13991000D02*
Y14110999D01*
X8342000Y9906000D02*
X8422000D01*
X8382000Y9866000D02*
Y9946000D01*
X8342000Y10160000D02*
X8422000D01*
X8382000Y10120000D02*
Y10200000D01*
X8068000Y10033000D02*
X8188000D01*
X8128000Y9973000D02*
Y10093000D01*
X23064000Y16637003D02*
X23163998D01*
X23113998Y16587003D02*
Y16687003D01*
X23064000Y16383002D02*
X23163998D01*
X23113998Y16333002D02*
Y16433002D01*
X23064000Y16129002D02*
X23163998D01*
X23113998Y16079002D02*
Y16179002D01*
X23064000Y15875002D02*
X23163998D01*
X23113998Y15825002D02*
Y15925002D01*
X23064000Y15621002D02*
X23163998D01*
X23113998Y15571002D02*
Y15671002D01*
X23064000Y15367001D02*
X23163998D01*
X23113998Y15317001D02*
Y15417001D01*
X23064000Y15113002D02*
X23163998D01*
X23113998Y15063002D02*
Y15163002D01*
X23064000Y14859003D02*
X23163998D01*
X23113998Y14809003D02*
Y14909003D01*
X23064000Y12827002D02*
X23163998D01*
X23113998Y12777002D02*
Y12877002D01*
X23064000Y13081001D02*
X23163998D01*
X23113998Y13031001D02*
Y13131001D01*
X23064000Y13335002D02*
X23163998D01*
X23113998Y13285002D02*
Y13385002D01*
X23064000Y13589001D02*
X23163998D01*
X23113998Y13539001D02*
Y13639001D01*
X23064000Y13843002D02*
X23163998D01*
X23113998Y13793002D02*
Y13893002D01*
X23064000Y14097002D02*
X23163998D01*
X23113998Y14047002D02*
Y14147002D01*
X23064000Y14351003D02*
X23163998D01*
X23113998Y14301003D02*
Y14401003D01*
X23064000Y14605002D02*
X23163998D01*
X23113998Y14555002D02*
Y14655002D01*
X23064000Y10795002D02*
X23163998D01*
X23113998Y10745002D02*
Y10845002D01*
X23064000Y11049002D02*
X23163998D01*
X23113998Y10999002D02*
Y11099002D01*
X23064000Y11303002D02*
X23163998D01*
X23113998Y11253002D02*
Y11353002D01*
X23064000Y11557002D02*
X23163998D01*
X23113998Y11507002D02*
Y11607002D01*
X23064000Y11811002D02*
X23163998D01*
X23113998Y11761002D02*
Y11861002D01*
X23064000Y12065002D02*
X23163998D01*
X23113998Y12015002D02*
Y12115002D01*
X23064000Y12319002D02*
X23163998D01*
X23113998Y12269002D02*
Y12369002D01*
X23064000Y12573002D02*
X23163998D01*
X23113998Y12523002D02*
Y12623002D01*
X23064000Y8763002D02*
X23163998D01*
X23113998Y8713002D02*
Y8813002D01*
X23064000Y9017002D02*
X23163998D01*
X23113998Y8967002D02*
Y9067002D01*
X23064000Y9271002D02*
X23163998D01*
X23113998Y9221002D02*
Y9321002D01*
X23064000Y9525002D02*
X23163998D01*
X23113998Y9475002D02*
Y9575002D01*
X23064000Y9779002D02*
X23163998D01*
X23113998Y9729002D02*
Y9829002D01*
X23064000Y10033002D02*
X23163998D01*
X23113998Y9983002D02*
Y10083002D01*
X23064000Y10287002D02*
X23163998D01*
X23113998Y10237002D02*
Y10337002D01*
X23064000Y10541002D02*
X23163998D01*
X23113998Y10491002D02*
Y10591002D01*
X23228000Y17145003D02*
X23507999D01*
X23367999Y17005002D02*
Y17285002D01*
X23228000Y8255002D02*
X23507999D01*
X23367999Y8115002D02*
Y8395002D01*
X22556000Y10541002D02*
X22656000D01*
X22606000Y10491002D02*
Y10591002D01*
X22556000Y10287002D02*
X22656000D01*
X22606000Y10237002D02*
Y10337002D01*
X22556000Y10033002D02*
X22656000D01*
X22606000Y9983002D02*
Y10083002D01*
X22556000Y9779002D02*
X22656000D01*
X22606000Y9729002D02*
Y9829002D01*
X22556000Y9525002D02*
X22656000D01*
X22606000Y9475002D02*
Y9575002D01*
X22556000Y9271002D02*
X22656000D01*
X22606000Y9221002D02*
Y9321002D01*
X22556000Y9017002D02*
X22656000D01*
X22606000Y8967002D02*
Y9067002D01*
X22556000Y8763002D02*
X22656000D01*
X22606000Y8713002D02*
Y8813002D01*
X22556000Y12573002D02*
X22656000D01*
X22606000Y12523002D02*
Y12623002D01*
X22556000Y12319002D02*
X22656000D01*
X22606000Y12269002D02*
Y12369002D01*
X22556000Y12065002D02*
X22656000D01*
X22606000Y12015002D02*
Y12115002D01*
X22556000Y11811002D02*
X22656000D01*
X22606000Y11761002D02*
Y11861002D01*
X22556000Y11557002D02*
X22656000D01*
X22606000Y11507002D02*
Y11607002D01*
X22556000Y11303002D02*
X22656000D01*
X22606000Y11253002D02*
Y11353002D01*
X22556000Y11049002D02*
X22656000D01*
X22606000Y10999002D02*
Y11099002D01*
X22556000Y10795002D02*
X22656000D01*
X22606000Y10745002D02*
Y10845002D01*
X22556000Y14605002D02*
X22656000D01*
X22606000Y14555002D02*
Y14655002D01*
X22556000Y14351003D02*
X22656000D01*
X22606000Y14301003D02*
Y14401003D01*
X22556000Y14097002D02*
X22656000D01*
X22606000Y14047002D02*
Y14147002D01*
X22556000Y13843002D02*
X22656000D01*
X22606000Y13793002D02*
Y13893002D01*
X22556000Y13589001D02*
X22656000D01*
X22606000Y13539001D02*
Y13639001D01*
X22556000Y13335002D02*
X22656000D01*
X22606000Y13285002D02*
Y13385002D01*
X22556000Y13081001D02*
X22656000D01*
X22606000Y13031001D02*
Y13131001D01*
X22556000Y12827002D02*
X22656000D01*
X22606000Y12777002D02*
Y12877002D01*
X22556000Y14859003D02*
X22656000D01*
X22606000Y14809003D02*
Y14909003D01*
X22556000Y15113002D02*
X22656000D01*
X22606000Y15063002D02*
Y15163002D01*
X22556000Y15367001D02*
X22656000D01*
X22606000Y15317001D02*
Y15417001D01*
X22556000Y15621002D02*
X22656000D01*
X22606000Y15571002D02*
Y15671002D01*
X22556000Y15875002D02*
X22656000D01*
X22606000Y15825002D02*
Y15925002D01*
X22556000Y16129002D02*
X22656000D01*
X22606000Y16079002D02*
Y16179002D01*
X22556000Y16383002D02*
X22656000D01*
X22606000Y16333002D02*
Y16433002D01*
X22556000Y16637003D02*
X22656000D01*
X22606000Y16587003D02*
Y16687003D01*
X21377173Y9273156D02*
X21507172D01*
X21442172Y9208156D02*
Y9338156D01*
X20809229Y9268844D02*
X20939227D01*
X20874226Y9203844D02*
Y9333844D01*
X17339000Y9525000D02*
X17459000D01*
X17399001Y9465000D02*
Y9585000D01*
X17339000Y8509000D02*
X17459000D01*
X17399001Y8449000D02*
Y8569000D01*
X14814000Y9271000D02*
X14903999D01*
X14859000Y9226000D02*
Y9316000D01*
X14560001Y9271000D02*
X14650000D01*
X14605000Y9226000D02*
Y9316000D01*
X15067999Y9271000D02*
X15158000D01*
X15113000Y9226000D02*
Y9316000D01*
X15067999Y8509000D02*
X15158000D01*
X15113000Y8464000D02*
Y8554000D01*
X14814000Y8509000D02*
X14903999D01*
X14859000Y8464000D02*
Y8554000D01*
X14560001Y8509000D02*
X14650000D01*
X14605000Y8464000D02*
Y8554000D01*
X14560001Y15900400D02*
X14650000D01*
X14605000Y15855400D02*
Y15945399D01*
X14814000Y15900400D02*
X14903999D01*
X14859000Y15855400D02*
Y15945399D01*
X15067999Y15900400D02*
X15158000D01*
X15113000Y15855400D02*
Y15945399D01*
X15067999Y16662399D02*
X15158000D01*
X15113000Y16617400D02*
Y16707401D01*
X14560001Y16662399D02*
X14650000D01*
X14605000Y16617400D02*
Y16707401D01*
X14814000Y16662399D02*
X14903999D01*
X14859000Y16617400D02*
Y16707401D01*
X15067999Y17043401D02*
X15158000D01*
X15113000Y16998399D02*
Y17088400D01*
X14052000Y17043401D02*
X14142000D01*
X14097000Y16998399D02*
Y17088400D01*
X14560001Y15519400D02*
X14650000D01*
X14605000Y15474400D02*
Y15564400D01*
X15575999Y15519400D02*
X15666000D01*
X15621001Y15474400D02*
Y15564400D01*
X8068000Y11557000D02*
X8188000D01*
X8128000Y11497000D02*
Y11617000D01*
X8342000Y11684000D02*
X8422000D01*
X8382000Y11644000D02*
Y11724000D01*
X8342000Y11430000D02*
X8422000D01*
X8382000Y11390000D02*
Y11470000D01*
X17339000Y15900400D02*
X17459000D01*
X17399001Y15840401D02*
Y15960400D01*
X17339000Y16916400D02*
X17459000D01*
X17399001Y16856400D02*
Y16976401D01*
X17339000Y13462000D02*
X17459000D01*
X17399001Y13402000D02*
Y13522000D01*
X17339000Y14478000D02*
X17459000D01*
X17399001Y14417999D02*
Y14538000D01*
X17339000Y10922000D02*
X17459000D01*
X17399001Y10862000D02*
Y10982000D01*
X17339000Y11938000D02*
X17459000D01*
X17399001Y11878000D02*
Y11998000D01*
X14560001Y13462000D02*
X14650000D01*
X14605000Y13417000D02*
Y13507001D01*
X14814000Y13462000D02*
X14903999D01*
X14859000Y13417000D02*
Y13507001D01*
X15067999Y13462000D02*
X15158000D01*
X15113000Y13417000D02*
Y13507001D01*
X15067999Y14224001D02*
X15158000D01*
X15113000Y14178999D02*
Y14269000D01*
X14560001Y14224001D02*
X14650000D01*
X14605000Y14178999D02*
Y14269000D01*
X14814000Y14224001D02*
X14903999D01*
X14859000Y14178999D02*
Y14269000D01*
X14560001Y10922000D02*
X14650000D01*
X14605000Y10877000D02*
Y10967000D01*
X14814000Y10922000D02*
X14903999D01*
X14859000Y10877000D02*
Y10967000D01*
X15067999Y10922000D02*
X15158000D01*
X15113000Y10877000D02*
Y10967000D01*
X15067999Y11684000D02*
X15158000D01*
X15113000Y11639000D02*
Y11729000D01*
X14560001Y11684000D02*
X14650000D01*
X14605000Y11639000D02*
Y11729000D01*
X14814000Y11684000D02*
X14903999D01*
X14859000Y11639000D02*
Y11729000D01*
X8068000Y11049000D02*
X8188000D01*
X8128000Y10989000D02*
Y11109000D01*
X8342000Y11176000D02*
X8422000D01*
X8382000Y11136000D02*
Y11216000D01*
X8342000Y10922000D02*
X8422000D01*
X8382000Y10882000D02*
Y10962000D01*
X8068000Y10541000D02*
X8188000D01*
X8128000Y10481000D02*
Y10601000D01*
X8342000Y10668000D02*
X8422000D01*
X8382000Y10628000D02*
Y10708000D01*
X8342000Y10414000D02*
X8422000D01*
X8382000Y10374000D02*
Y10454000D01*
X15449001Y17043401D02*
X15539000D01*
X15494000Y16998399D02*
Y17088400D01*
X16464999Y17043401D02*
X16555000D01*
X16510001Y16998399D02*
Y17088400D01*
X9988000Y11430000D02*
X10078000D01*
X10033000Y11385000D02*
Y11475000D01*
X8972000Y11430000D02*
X9062000D01*
X9017000Y11385000D02*
Y11475000D01*
X14560001Y13081000D02*
X14650000D01*
X14605000Y13036000D02*
Y13125999D01*
X15575999Y13081000D02*
X15666000D01*
X15621001Y13036000D02*
Y13125999D01*
X15449001Y14605000D02*
X15539000D01*
X15494000Y14560001D02*
Y14650000D01*
X16464999Y14605000D02*
X16555000D01*
X16510001Y14560001D02*
Y14650000D01*
X15067999Y14605000D02*
X15158000D01*
X15113000Y14560001D02*
Y14650000D01*
X14052000Y14605000D02*
X14142000D01*
X14097000Y14560001D02*
Y14650000D01*
X10013400Y10922000D02*
X10103400D01*
X10058400Y10877000D02*
Y10967000D01*
X8997400Y10922000D02*
X9087400D01*
X9042400Y10877000D02*
Y10967000D01*
X14560001Y10541000D02*
X14650000D01*
X14605000Y10496000D02*
Y10586000D01*
X15575999Y10541000D02*
X15666000D01*
X15621001Y10496000D02*
Y10586000D01*
X15449001Y12065000D02*
X15539000D01*
X15494000Y12020000D02*
Y12110000D01*
X16464999Y12065000D02*
X16555000D01*
X16510001Y12020000D02*
Y12110000D01*
X15067999Y12065000D02*
X15158000D01*
X15113000Y12020000D02*
Y12110000D01*
X14052000Y12065000D02*
X14142000D01*
X14097000Y12020000D02*
Y12110000D01*
X10013400Y10414000D02*
X10103400D01*
X10058400Y10369000D02*
Y10459000D01*
X8997400Y10414000D02*
X9087400D01*
X9042400Y10369000D02*
Y10459000D01*
X15962000Y16662399D02*
X16042000D01*
X16002000Y16622400D02*
Y16702400D01*
X16470000Y16662399D02*
X16550000D01*
X16510001Y16622400D02*
Y16702400D01*
X16978000Y16154401D02*
X17058000D01*
X17017999Y16114400D02*
Y16194400D01*
X16978000Y16662399D02*
X17058000D01*
X17017999Y16622400D02*
Y16702400D01*
X15962000Y16154401D02*
X16042000D01*
X16002000Y16114400D02*
Y16194400D01*
X16470000Y16154401D02*
X16550000D01*
X16510001Y16114400D02*
Y16194400D01*
X15962000Y14224001D02*
X16042000D01*
X16002000Y14184000D02*
Y14264000D01*
X16470000Y14224001D02*
X16550000D01*
X16510001Y14184000D02*
Y14264000D01*
X16978000Y13716000D02*
X17058000D01*
X17017999Y13675999D02*
Y13756000D01*
X16978000Y14224001D02*
X17058000D01*
X17017999Y14184000D02*
Y14264000D01*
X15962000Y13716000D02*
X16042000D01*
X16002000Y13675999D02*
Y13756000D01*
X16470000Y13716000D02*
X16550000D01*
X16510001Y13675999D02*
Y13756000D01*
X15962000Y11684000D02*
X16042000D01*
X16002000Y11644000D02*
Y11724000D01*
X16470000Y11684000D02*
X16550000D01*
X16510001Y11644000D02*
Y11724000D01*
X16978000Y11176000D02*
X17058000D01*
X17017999Y11136000D02*
Y11216000D01*
X16978000Y11684000D02*
X17058000D01*
X17017999Y11644000D02*
Y11724000D01*
X15962000Y11176000D02*
X16042000D01*
X16002000Y11136000D02*
Y11216000D01*
X16470000Y11176000D02*
X16550000D01*
X16510001Y11136000D02*
Y11216000D01*
X15575999Y8128000D02*
X15666000D01*
X15621001Y8083000D02*
Y8173000D01*
X14560001Y8128000D02*
X14650000D01*
X14605000Y8083000D02*
Y8173000D01*
X16464999Y9652000D02*
X16555000D01*
X16510001Y9607000D02*
Y9697000D01*
X15449001Y9652000D02*
X15539000D01*
X15494000Y9607000D02*
Y9697000D01*
X14052000Y9652000D02*
X14142000D01*
X14097000Y9607000D02*
Y9697000D01*
X15067999Y9652000D02*
X15158000D01*
X15113000Y9607000D02*
Y9697000D01*
X7866000Y8255000D02*
X8136000D01*
X8001000Y8120000D02*
Y8390000D01*
X7866000Y17145000D02*
X8136000D01*
X8001000Y17010001D02*
Y17280000D01*
X13239200Y12928600D02*
X13329201D01*
X13284200Y12883600D02*
Y12973599D01*
X12985201Y12928600D02*
X13075200D01*
X13030200Y12883600D02*
Y12973599D01*
%TF.MD5,066e6ad01f51fbf00a67d0588ad3814b*%
M02*
