%TF.GenerationSoftware,Altium Limited,Altium Designer,19.1.5 (86)*%
G04 Layer_Color=16711935*
%FSLAX45Y45*%
%MOMM*%
%TF.FileFunction,Soldermask,Bot*%
%TF.Part,Single*%
G01*
G75*
%TA.AperFunction,NonConductor*%
%ADD12C,0.17780*%
%TA.AperFunction,ComponentPad*%
%ADD14C,1.60000*%
%ADD15C,1.50000*%
%ADD16C,3.75000*%
%ADD17C,1.90000*%
%ADD19C,1.70000*%
%ADD21C,2.00000*%
%ADD22R,1.60000X1.60000*%
%TA.AperFunction,ViaPad*%
%ADD23C,4.45000*%
%ADD24C,1.60000*%
%TA.AperFunction,ComponentPad*%
%ADD27C,5.10000*%
%ADD28C,1.20000*%
D12*
X22098000Y4508459D02*
Y4318000D01*
Y4508459D02*
X22016376D01*
X21989166Y4499390D01*
X21980096Y4490320D01*
X21971027Y4472181D01*
Y4454042D01*
X21980096Y4435903D01*
X21989166Y4426834D01*
X22016376Y4417764D01*
X22098000D02*
X22016376D01*
X21989166Y4408695D01*
X21980096Y4399625D01*
X21971027Y4381486D01*
Y4354278D01*
X21980096Y4336139D01*
X21989166Y4327070D01*
X22016376Y4318000D01*
X22098000D01*
X21883054Y4444973D02*
X21901192Y4435903D01*
X21919331Y4417764D01*
X21928401Y4390556D01*
Y4372417D01*
X21919331Y4345208D01*
X21901192Y4327070D01*
X21883054Y4318000D01*
X21855846D01*
X21837706Y4327070D01*
X21819566Y4345208D01*
X21810497Y4372417D01*
Y4390556D01*
X21819566Y4417764D01*
X21837706Y4435903D01*
X21855846Y4444973D01*
X21883054D01*
X21741570Y4508459D02*
Y4354278D01*
X21732500Y4327070D01*
X21714362Y4318000D01*
X21696222D01*
X21768777Y4444973D02*
X21705292D01*
X21641805Y4508459D02*
Y4354278D01*
X21632735Y4327070D01*
X21614597Y4318000D01*
X21596457D01*
X21669012Y4444973D02*
X21605527D01*
X21523901D02*
X21542039Y4435903D01*
X21560179Y4417764D01*
X21569249Y4390556D01*
Y4372417D01*
X21560179Y4345208D01*
X21542039Y4327070D01*
X21523901Y4318000D01*
X21496693D01*
X21478554Y4327070D01*
X21460416Y4345208D01*
X21451346Y4372417D01*
Y4390556D01*
X21460416Y4417764D01*
X21478554Y4435903D01*
X21496693Y4444973D01*
X21523901D01*
X21409625D02*
Y4318000D01*
Y4408695D02*
X21382417Y4435903D01*
X21364279Y4444973D01*
X21337070D01*
X21318932Y4435903D01*
X21309862Y4408695D01*
Y4318000D01*
Y4408695D02*
X21282652Y4435903D01*
X21264514Y4444973D01*
X21237306D01*
X21219167Y4435903D01*
X21210097Y4408695D01*
Y4318000D01*
X20873619Y4481251D02*
X20891759Y4499390D01*
X20918967Y4508459D01*
X20955244D01*
X20982452Y4499390D01*
X21000592Y4481251D01*
Y4463112D01*
X20991524Y4444973D01*
X20982452Y4435903D01*
X20964314Y4426834D01*
X20909897Y4408695D01*
X20891759Y4399625D01*
X20882689Y4390556D01*
X20873619Y4372417D01*
Y4345208D01*
X20891759Y4327070D01*
X20918967Y4318000D01*
X20955244D01*
X20982452Y4327070D01*
X21000592Y4345208D01*
X20785645Y4444973D02*
X20803784Y4435903D01*
X20821922Y4417764D01*
X20830994Y4390556D01*
Y4372417D01*
X20821922Y4345208D01*
X20803784Y4327070D01*
X20785645Y4318000D01*
X20758437D01*
X20740298Y4327070D01*
X20722159Y4345208D01*
X20713091Y4372417D01*
Y4390556D01*
X20722159Y4417764D01*
X20740298Y4435903D01*
X20758437Y4444973D01*
X20785645D01*
X20671370Y4508459D02*
Y4318000D01*
X20522630Y4508459D02*
Y4318000D01*
Y4417764D02*
X20540768Y4435903D01*
X20558908Y4444973D01*
X20586118D01*
X20604256Y4435903D01*
X20622395Y4417764D01*
X20631464Y4390556D01*
Y4372417D01*
X20622395Y4345208D01*
X20604256Y4327070D01*
X20586118Y4318000D01*
X20558908D01*
X20540768Y4327070D01*
X20522630Y4345208D01*
X20471841Y4390556D02*
X20363007D01*
Y4408695D01*
X20372076Y4426834D01*
X20381146Y4435903D01*
X20399284Y4444973D01*
X20426494D01*
X20444633Y4435903D01*
X20462772Y4417764D01*
X20471841Y4390556D01*
Y4372417D01*
X20462772Y4345208D01*
X20444633Y4327070D01*
X20426494Y4318000D01*
X20399284D01*
X20381146Y4327070D01*
X20363007Y4345208D01*
X20322195Y4444973D02*
Y4318000D01*
Y4390556D02*
X20313126Y4417764D01*
X20294986Y4435903D01*
X20276846Y4444973D01*
X20249638D01*
D14*
X9067800Y9906000D02*
D03*
X10083800D02*
D03*
X14859000Y9271000D02*
D03*
X14605000D02*
D03*
X15113000D02*
D03*
Y8509000D02*
D03*
X14859000D02*
D03*
Y15900400D02*
D03*
X15113000D02*
D03*
Y16662399D02*
D03*
X14605000D02*
D03*
X14859000D02*
D03*
X15113000Y17043401D02*
D03*
X14097000D02*
D03*
X14605000Y15519400D02*
D03*
X15621001D02*
D03*
X14859000Y13462000D02*
D03*
X15113000D02*
D03*
Y14224001D02*
D03*
X14605000D02*
D03*
X14859000D02*
D03*
Y10922000D02*
D03*
X15113000D02*
D03*
Y11684000D02*
D03*
X14605000D02*
D03*
X14859000D02*
D03*
X15494000Y17043401D02*
D03*
X16510001D02*
D03*
X10033000Y11430000D02*
D03*
X9017000D02*
D03*
X14605000Y13081000D02*
D03*
X15621001D02*
D03*
X15494000Y14605000D02*
D03*
X16510001D02*
D03*
X15113000D02*
D03*
X14097000D02*
D03*
X10058400Y10922000D02*
D03*
X9042400D02*
D03*
X14605000Y10541000D02*
D03*
X15621001D02*
D03*
X15494000Y12065000D02*
D03*
X16510001D02*
D03*
X15113000D02*
D03*
X14097000D02*
D03*
X10058400Y10414000D02*
D03*
X9042400D02*
D03*
X15621001Y8128000D02*
D03*
X14605000D02*
D03*
X16510001Y9652000D02*
D03*
X15494000D02*
D03*
X14097000D02*
D03*
X15113000D02*
D03*
D15*
X16510001Y8763000D02*
D03*
X16002000D02*
D03*
X17017999Y9271000D02*
D03*
Y8763000D02*
D03*
X16510001Y9271000D02*
D03*
X16002000D02*
D03*
X8382000Y9906000D02*
D03*
Y10160000D02*
D03*
Y11684000D02*
D03*
Y11430000D02*
D03*
Y11176000D02*
D03*
Y10922000D02*
D03*
Y10668000D02*
D03*
Y10414000D02*
D03*
X16002000Y16662399D02*
D03*
X16510001D02*
D03*
X17017999Y16154401D02*
D03*
Y16662399D02*
D03*
X16002000Y16154401D02*
D03*
X16510001D02*
D03*
X16002000Y14224001D02*
D03*
X16510001D02*
D03*
X17017999Y13716000D02*
D03*
Y14224001D02*
D03*
X16002000Y13716000D02*
D03*
X16510001D02*
D03*
X16002000Y11684000D02*
D03*
X16510001D02*
D03*
X17017999Y11176000D02*
D03*
Y11684000D02*
D03*
X16002000Y11176000D02*
D03*
X16510001D02*
D03*
D16*
X9055000Y15716000D02*
D03*
X8255000D02*
D03*
X9055000Y13216998D02*
D03*
X8255000D02*
D03*
D17*
X8930000Y14605000D02*
D03*
X9214000Y13912498D02*
D03*
Y14189500D02*
D03*
Y14466499D02*
D03*
Y14743500D02*
D03*
Y15020500D02*
D03*
X8930000Y14882001D02*
D03*
Y14328000D02*
D03*
Y14050999D02*
D03*
X8255000Y14605000D02*
D03*
X8539000Y13912498D02*
D03*
Y14189500D02*
D03*
Y14466499D02*
D03*
Y14743500D02*
D03*
Y15020500D02*
D03*
X8255000Y14882001D02*
D03*
Y14328000D02*
D03*
Y14050999D02*
D03*
X17399001Y9525000D02*
D03*
Y8509000D02*
D03*
Y15900400D02*
D03*
Y16916400D02*
D03*
Y13462000D02*
D03*
Y14478000D02*
D03*
Y10922000D02*
D03*
Y11938000D02*
D03*
D19*
X23113998Y16637003D02*
D03*
Y16383002D02*
D03*
Y16129002D02*
D03*
Y15875002D02*
D03*
Y15621002D02*
D03*
Y15367001D02*
D03*
Y15113002D02*
D03*
Y14859003D02*
D03*
Y12827002D02*
D03*
Y13081001D02*
D03*
Y13335002D02*
D03*
Y13589001D02*
D03*
Y13843002D02*
D03*
Y14097002D02*
D03*
Y14351003D02*
D03*
Y14605002D02*
D03*
Y10795002D02*
D03*
Y11049002D02*
D03*
Y11303002D02*
D03*
Y11557002D02*
D03*
Y11811002D02*
D03*
Y12065002D02*
D03*
Y12319002D02*
D03*
Y12573002D02*
D03*
Y8763002D02*
D03*
Y9017002D02*
D03*
Y9271002D02*
D03*
Y9525002D02*
D03*
Y9779002D02*
D03*
Y10033002D02*
D03*
Y10287002D02*
D03*
Y10541002D02*
D03*
X22606000D02*
D03*
Y10287002D02*
D03*
Y10033002D02*
D03*
Y9779002D02*
D03*
Y9525002D02*
D03*
Y9271002D02*
D03*
Y9017002D02*
D03*
Y8763002D02*
D03*
Y12573002D02*
D03*
Y12319002D02*
D03*
Y12065002D02*
D03*
Y11811002D02*
D03*
Y11557002D02*
D03*
Y11303002D02*
D03*
Y11049002D02*
D03*
Y10795002D02*
D03*
Y14605002D02*
D03*
Y14351003D02*
D03*
Y14097002D02*
D03*
Y13843002D02*
D03*
Y13589001D02*
D03*
Y13335002D02*
D03*
Y13081001D02*
D03*
Y12827002D02*
D03*
Y14859003D02*
D03*
Y15113002D02*
D03*
Y15367001D02*
D03*
Y15621002D02*
D03*
Y15875002D02*
D03*
Y16129002D02*
D03*
Y16383002D02*
D03*
Y16637003D02*
D03*
D21*
X21442172Y9273156D02*
D03*
X20874226Y9268844D02*
D03*
D22*
X14605000Y8509000D02*
D03*
Y15900400D02*
D03*
Y13462000D02*
D03*
Y10922000D02*
D03*
D23*
X8001000Y8255000D02*
D03*
Y17145000D02*
D03*
D24*
X13284200Y12928600D02*
D03*
X13030200D02*
D03*
D27*
X23367999Y17145003D02*
D03*
Y8255002D02*
D03*
D28*
X8128000Y10033000D02*
D03*
Y11557000D02*
D03*
Y11049000D02*
D03*
Y10541000D02*
D03*
%TF.MD5,b2914fe2966ef8e11f5530ea901353ca*%
M02*
