%TF.GenerationSoftware,Altium Limited,Altium Designer,19.1.5 (86)*%
G04 Layer_Color=0*
%FSLAX45Y45*%
%MOMM*%
%TF.FileFunction,Profile,NP*%
%TF.Part,Single*%
G01*
G75*
%TA.AperFunction,Profile*%
%ADD36C,0.02540*%
D36*
X7643992Y7699997D02*
X23643993D01*
Y17699997D01*
X7643992D01*
Y7699997D01*
%TF.MD5,f72ab2ace4cc07e93e65209755d70344*%
M02*
