Added Pin To Net: NetName=DO_3 Pin=D30-1
Added Pin To Net: NetName=DO_3 Pin=RL30-3
Added Pin To Net: NetName=NetIC30_1 Pin=IC30-1
Added Pin To Net: NetName=NetIC30_1 Pin=R30-2
Added Net: Name=NetIC30_1
Added Member To Class: ClassName=Velo ISEG V3 Member=Component RL40 REL_TYCO-AXICOM_V23026A1xxxB201
