%TF.GenerationSoftware,Altium Limited,Altium Designer,19.1.5 (86)*%
G04 Layer_Color=8388736*
%FSLAX45Y45*%
%MOMM*%
%TF.FileFunction,Other,Mechanical_2*%
%TF.Part,Single*%
G01*
G75*
%TA.AperFunction,NonConductor*%
%ADD12C,0.17780*%
%ADD29C,0.20000*%
%ADD31C,0.25000*%
D12*
X23250043Y4717112D02*
X23240973Y4735251D01*
X23222833Y4753390D01*
X23204695Y4762459D01*
X23168417D01*
X23150278Y4753390D01*
X23132140Y4735251D01*
X23123070Y4717112D01*
X23114000Y4689903D01*
Y4644556D01*
X23123070Y4617347D01*
X23132140Y4599208D01*
X23150278Y4581070D01*
X23168417Y4572000D01*
X23204695D01*
X23222833Y4581070D01*
X23240973Y4599208D01*
X23250043Y4617347D01*
X23348900Y4698973D02*
X23330762Y4689903D01*
X23312622Y4671764D01*
X23303552Y4644556D01*
Y4626417D01*
X23312622Y4599208D01*
X23330762Y4581070D01*
X23348900Y4572000D01*
X23376108D01*
X23394247Y4581070D01*
X23412386Y4599208D01*
X23421455Y4626417D01*
Y4644556D01*
X23412386Y4671764D01*
X23394247Y4689903D01*
X23376108Y4698973D01*
X23348900D01*
X23463174D02*
Y4572000D01*
Y4662695D02*
X23490384Y4689903D01*
X23508524Y4698973D01*
X23535732D01*
X23553870Y4689903D01*
X23562939Y4662695D01*
Y4572000D01*
Y4662695D02*
X23590147Y4689903D01*
X23608287Y4698973D01*
X23635497D01*
X23653635Y4689903D01*
X23662704Y4662695D01*
Y4572000D01*
X23722563Y4698973D02*
Y4508514D01*
Y4671764D02*
X23740701Y4689903D01*
X23758841Y4698973D01*
X23786049D01*
X23804189Y4689903D01*
X23822327Y4671764D01*
X23831396Y4644556D01*
Y4626417D01*
X23822327Y4599208D01*
X23804189Y4581070D01*
X23786049Y4572000D01*
X23758841D01*
X23740701Y4581070D01*
X23722563Y4599208D01*
X23917557Y4698973D02*
X23899419Y4689903D01*
X23881279Y4671764D01*
X23872209Y4644556D01*
Y4626417D01*
X23881279Y4599208D01*
X23899419Y4581070D01*
X23917557Y4572000D01*
X23944765D01*
X23962904Y4581070D01*
X23981042Y4599208D01*
X23990112Y4626417D01*
Y4644556D01*
X23981042Y4671764D01*
X23962904Y4689903D01*
X23944765Y4698973D01*
X23917557D01*
X24031831D02*
Y4572000D01*
Y4662695D02*
X24059041Y4689903D01*
X24077179Y4698973D01*
X24104388D01*
X24122527Y4689903D01*
X24131596Y4662695D01*
Y4572000D01*
X24181477Y4644556D02*
X24290312D01*
Y4662695D01*
X24281242Y4680834D01*
X24272173Y4689903D01*
X24254034Y4698973D01*
X24226826D01*
X24208687Y4689903D01*
X24190549Y4671764D01*
X24181477Y4644556D01*
Y4626417D01*
X24190549Y4599208D01*
X24208687Y4581070D01*
X24226826Y4572000D01*
X24254034D01*
X24272173Y4581070D01*
X24290312Y4599208D01*
X24331125Y4698973D02*
Y4572000D01*
Y4662695D02*
X24358333Y4689903D01*
X24376472Y4698973D01*
X24403680D01*
X24421820Y4689903D01*
X24430888Y4662695D01*
Y4572000D01*
X24507980Y4762459D02*
Y4608278D01*
X24517049Y4581070D01*
X24535188Y4572000D01*
X24553326D01*
X24480771Y4698973D02*
X24544257D01*
X24680299Y4671764D02*
X24671230Y4689903D01*
X24644022Y4698973D01*
X24616814D01*
X24589606Y4689903D01*
X24580536Y4671764D01*
X24589606Y4653625D01*
X24607744Y4644556D01*
X24653091Y4635486D01*
X24671230Y4626417D01*
X24680299Y4608278D01*
Y4599208D01*
X24671230Y4581070D01*
X24644022Y4572000D01*
X24616814D01*
X24589606Y4581070D01*
X24580536Y4599208D01*
X23114000Y4254459D02*
X23186555Y4064000D01*
X23259113Y4254459D02*
X23186555Y4064000D01*
X23301738Y4254459D02*
X23310808Y4245390D01*
X23319878Y4254459D01*
X23310808Y4263529D01*
X23301738Y4254459D01*
X23310808Y4190973D02*
Y4064000D01*
X23462268Y4190973D02*
Y4064000D01*
Y4163764D02*
X23444128Y4181903D01*
X23425990Y4190973D01*
X23398782D01*
X23380643Y4181903D01*
X23362505Y4163764D01*
X23353435Y4136556D01*
Y4118417D01*
X23362505Y4091208D01*
X23380643Y4073070D01*
X23398782Y4064000D01*
X23425990D01*
X23444128Y4073070D01*
X23462268Y4091208D01*
X23612822Y4163764D02*
X23603752Y4181903D01*
X23576544Y4190973D01*
X23549335D01*
X23522127Y4181903D01*
X23513057Y4163764D01*
X23522127Y4145625D01*
X23540266Y4136556D01*
X23585612Y4127486D01*
X23603752Y4118417D01*
X23612822Y4100278D01*
Y4091208D01*
X23603752Y4073070D01*
X23576544Y4064000D01*
X23549335D01*
X23522127Y4073070D01*
X23513057Y4091208D01*
X23114000Y4408695D02*
X23195625D01*
X23222833Y4417764D01*
X23231903Y4426834D01*
X23240973Y4444973D01*
Y4472181D01*
X23231903Y4490320D01*
X23222833Y4499390D01*
X23195625Y4508459D01*
X23114000D01*
Y4318000D01*
X23301738Y4508459D02*
X23310808Y4499390D01*
X23319878Y4508459D01*
X23310808Y4517529D01*
X23301738Y4508459D01*
X23310808Y4444973D02*
Y4318000D01*
X23353435Y4444973D02*
Y4318000D01*
Y4408695D02*
X23380643Y4435903D01*
X23398782Y4444973D01*
X23425990D01*
X23444128Y4435903D01*
X23453198Y4408695D01*
Y4318000D01*
X23602844Y4417764D02*
X23593776Y4435903D01*
X23566566Y4444973D01*
X23539359D01*
X23512151Y4435903D01*
X23503081Y4417764D01*
X23512151Y4399625D01*
X23530289Y4390556D01*
X23575636Y4381486D01*
X23593776Y4372417D01*
X23602844Y4354278D01*
Y4345208D01*
X23593776Y4327070D01*
X23566566Y4318000D01*
X23539359D01*
X23512151Y4327070D01*
X23503081Y4345208D01*
X24892000Y4472181D02*
X24910139Y4481251D01*
X24937347Y4508459D01*
Y4318000D01*
X25149573Y4444973D02*
X25140504Y4417764D01*
X25122365Y4399625D01*
X25095155Y4390556D01*
X25086087D01*
X25058879Y4399625D01*
X25040739Y4417764D01*
X25031670Y4444973D01*
Y4454042D01*
X25040739Y4481251D01*
X25058879Y4499390D01*
X25086087Y4508459D01*
X25095155D01*
X25122365Y4499390D01*
X25140504Y4481251D01*
X25149573Y4444973D01*
Y4399625D01*
X25140504Y4354278D01*
X25122365Y4327070D01*
X25095155Y4318000D01*
X25077017D01*
X25049809Y4327070D01*
X25040739Y4345208D01*
X25210339Y4463112D02*
Y4472181D01*
X25219408Y4490320D01*
X25228477Y4499390D01*
X25246617Y4508459D01*
X25282895D01*
X25301035Y4499390D01*
X25310103Y4490320D01*
X25319173Y4472181D01*
Y4454042D01*
X25310103Y4435903D01*
X25291965Y4408695D01*
X25201270Y4318000D01*
X25328242D01*
X24901070Y4209112D02*
Y4218181D01*
X24910139Y4236320D01*
X24919208Y4245390D01*
X24937347Y4254459D01*
X24973625D01*
X24991763Y4245390D01*
X25000835Y4236320D01*
X25009903Y4218181D01*
Y4200042D01*
X25000835Y4181903D01*
X24982695Y4154695D01*
X24892000Y4064000D01*
X25018973D01*
X24892000Y3964181D02*
X24910139Y3973251D01*
X24937347Y4000459D01*
Y3810000D01*
X25149573Y3936973D02*
X25140504Y3909764D01*
X25122365Y3891625D01*
X25095155Y3882556D01*
X25086087D01*
X25058879Y3891625D01*
X25040739Y3909764D01*
X25031670Y3936973D01*
Y3946042D01*
X25040739Y3973251D01*
X25058879Y3991390D01*
X25086087Y4000459D01*
X25095155D01*
X25122365Y3991390D01*
X25140504Y3973251D01*
X25149573Y3936973D01*
Y3891625D01*
X25140504Y3846278D01*
X25122365Y3819070D01*
X25095155Y3810000D01*
X25077017D01*
X25049809Y3819070D01*
X25040739Y3837208D01*
X25291965Y4000459D02*
X25201270Y3873486D01*
X25337312D01*
X25291965Y4000459D02*
Y3810000D01*
X24910139Y4762459D02*
X25009903D01*
X24955486Y4689903D01*
X24982695D01*
X25000835Y4680834D01*
X25009903Y4671764D01*
X25018973Y4644556D01*
Y4626417D01*
X25009903Y4599208D01*
X24991763Y4581070D01*
X24964555Y4572000D01*
X24937347D01*
X24910139Y4581070D01*
X24901070Y4590139D01*
X24892000Y4608278D01*
X25170433Y4735251D02*
X25161365Y4753390D01*
X25134155Y4762459D01*
X25116016D01*
X25088808Y4753390D01*
X25070670Y4726181D01*
X25061600Y4680834D01*
Y4635486D01*
X25070670Y4599208D01*
X25088808Y4581070D01*
X25116016Y4572000D01*
X25125085D01*
X25152293Y4581070D01*
X25170433Y4599208D01*
X25179503Y4626417D01*
Y4635486D01*
X25170433Y4662695D01*
X25152293Y4680834D01*
X25125085Y4689903D01*
X25116016D01*
X25088808Y4680834D01*
X25070670Y4662695D01*
X25061600Y4635486D01*
X23114000Y4000459D02*
Y3810000D01*
X23240973Y4000459D02*
Y3810000D01*
X23114000Y3909764D02*
X23240973D01*
X23338924Y3936973D02*
X23320784Y3927903D01*
X23302644Y3909764D01*
X23293576Y3882556D01*
Y3864417D01*
X23302644Y3837208D01*
X23320784Y3819070D01*
X23338924Y3810000D01*
X23366132D01*
X23384270Y3819070D01*
X23402409Y3837208D01*
X23411479Y3864417D01*
Y3882556D01*
X23402409Y3909764D01*
X23384270Y3927903D01*
X23366132Y3936973D01*
X23338924D01*
X23453198Y4000459D02*
Y3810000D01*
X23493105Y3882556D02*
X23601938D01*
Y3900695D01*
X23592870Y3918834D01*
X23583800Y3927903D01*
X23565660Y3936973D01*
X23538452D01*
X23520312Y3927903D01*
X23502174Y3909764D01*
X23493105Y3882556D01*
Y3864417D01*
X23502174Y3837208D01*
X23520312Y3819070D01*
X23538452Y3810000D01*
X23565660D01*
X23583800Y3819070D01*
X23601938Y3837208D01*
X23742516Y3909764D02*
X23733446Y3927903D01*
X23706236Y3936973D01*
X23679028D01*
X23651820Y3927903D01*
X23642751Y3909764D01*
X23651820Y3891625D01*
X23669958Y3882556D01*
X23715308Y3873486D01*
X23733446Y3864417D01*
X23742516Y3846278D01*
Y3837208D01*
X23733446Y3819070D01*
X23706236Y3810000D01*
X23679028D01*
X23651820Y3819070D01*
X23642751Y3837208D01*
X23114000Y3746459D02*
Y3556000D01*
Y3746459D02*
X23240973Y3556000D01*
Y3746459D02*
Y3556000D01*
X23293576Y3628556D02*
X23402409D01*
Y3646695D01*
X23393340Y3664834D01*
X23384270Y3673903D01*
X23366132Y3682973D01*
X23338924D01*
X23320784Y3673903D01*
X23302644Y3655764D01*
X23293576Y3628556D01*
Y3610417D01*
X23302644Y3583208D01*
X23320784Y3565070D01*
X23338924Y3556000D01*
X23366132D01*
X23384270Y3565070D01*
X23402409Y3583208D01*
X23470432Y3746459D02*
Y3592278D01*
X23479500Y3565070D01*
X23497639Y3556000D01*
X23515778D01*
X23443222Y3682973D02*
X23506708D01*
X23642751Y3655764D02*
X23633681Y3673903D01*
X23606473Y3682973D01*
X23579263D01*
X23552055Y3673903D01*
X23542986Y3655764D01*
X23552055Y3637625D01*
X23570195Y3628556D01*
X23615543Y3619486D01*
X23633681Y3610417D01*
X23642751Y3592278D01*
Y3583208D01*
X23633681Y3565070D01*
X23606473Y3556000D01*
X23579263D01*
X23552055Y3565070D01*
X23542986Y3583208D01*
X24901070Y3701112D02*
Y3710181D01*
X24910139Y3728320D01*
X24919208Y3737390D01*
X24937347Y3746459D01*
X24973625D01*
X24991763Y3737390D01*
X25000835Y3728320D01*
X25009903Y3710181D01*
Y3692042D01*
X25000835Y3673903D01*
X24982695Y3646695D01*
X24892000Y3556000D01*
X25018973D01*
X25179503Y3682973D02*
X25170433Y3655764D01*
X25152293Y3637625D01*
X25125085Y3628556D01*
X25116016D01*
X25088808Y3637625D01*
X25070670Y3655764D01*
X25061600Y3682973D01*
Y3692042D01*
X25070670Y3719251D01*
X25088808Y3737390D01*
X25116016Y3746459D01*
X25125085D01*
X25152293Y3737390D01*
X25170433Y3719251D01*
X25179503Y3682973D01*
Y3637625D01*
X25170433Y3592278D01*
X25152293Y3565070D01*
X25125085Y3556000D01*
X25106947D01*
X25079738Y3565070D01*
X25070670Y3583208D01*
D29*
X7643992Y18200002D02*
X7793992Y18250002D01*
X7643992Y18200002D02*
X7793992Y18150002D01*
X23493993D02*
X23643993Y18200002D01*
X23493993Y18250002D02*
X23643993Y18200002D01*
X7643992D02*
X14567059D01*
X16620924D02*
X23643993D01*
X7643992Y17764996D02*
Y18225002D01*
X23643993Y17764996D02*
Y18225002D01*
X24093999Y7849997D02*
X24143999Y7699997D01*
X24193999Y7849997D01*
X24143999Y17699997D02*
X24193999Y17549997D01*
X24093999D02*
X24143999Y17699997D01*
Y7699997D02*
Y11619137D01*
Y13680859D02*
Y17699997D01*
X23708990Y7699997D02*
X24168999D01*
X23708990Y17699997D02*
X24168999D01*
D31*
X14617059Y18221420D02*
X14631342Y18228561D01*
X14652765Y18249986D01*
Y18100018D01*
X14812730Y18228561D02*
X14805589Y18242845D01*
X14784166Y18249986D01*
X14769884D01*
X14748459Y18242845D01*
X14734177Y18221420D01*
X14727036Y18185715D01*
Y18150008D01*
X14734177Y18121442D01*
X14748459Y18107159D01*
X14769884Y18100018D01*
X14777023D01*
X14798448Y18107159D01*
X14812730Y18121442D01*
X14819872Y18142867D01*
Y18150008D01*
X14812730Y18171432D01*
X14798448Y18185715D01*
X14777023Y18192854D01*
X14769884D01*
X14748459Y18185715D01*
X14734177Y18171432D01*
X14727036Y18150008D01*
X14895570Y18249986D02*
X14874146Y18242845D01*
X14859863Y18221420D01*
X14852722Y18185715D01*
Y18164290D01*
X14859863Y18128584D01*
X14874146Y18107159D01*
X14895570Y18100018D01*
X14909853D01*
X14931277Y18107159D01*
X14945560Y18128584D01*
X14952701Y18164290D01*
Y18185715D01*
X14945560Y18221420D01*
X14931277Y18242845D01*
X14909853Y18249986D01*
X14895570D01*
X14993407Y18114301D02*
X14986266Y18107159D01*
X14993407Y18100018D01*
X15000548Y18107159D01*
X14993407Y18114301D01*
X15076247Y18249986D02*
X15054822Y18242845D01*
X15040540Y18221420D01*
X15033398Y18185715D01*
Y18164290D01*
X15040540Y18128584D01*
X15054822Y18107159D01*
X15076247Y18100018D01*
X15090529D01*
X15111954Y18107159D01*
X15126234Y18128584D01*
X15133376Y18164290D01*
Y18185715D01*
X15126234Y18221420D01*
X15111954Y18242845D01*
X15090529Y18249986D01*
X15076247D01*
X15166940Y18199997D02*
Y18100018D01*
Y18171432D02*
X15188365Y18192854D01*
X15202647Y18199997D01*
X15224071D01*
X15238354Y18192854D01*
X15245496Y18171432D01*
Y18100018D01*
Y18171432D02*
X15266919Y18192854D01*
X15281203Y18199997D01*
X15302626D01*
X15316908Y18192854D01*
X15324049Y18171432D01*
Y18100018D01*
X15371182Y18199997D02*
Y18100018D01*
Y18171432D02*
X15392607Y18192854D01*
X15406889Y18199997D01*
X15428313D01*
X15442596Y18192854D01*
X15449738Y18171432D01*
Y18100018D01*
Y18171432D02*
X15471161Y18192854D01*
X15485445Y18199997D01*
X15506868D01*
X15521150Y18192854D01*
X15528291Y18171432D01*
Y18100018D01*
X15757529Y18228561D02*
Y18100018D01*
X15693256Y18164290D02*
X15821800D01*
X15908923Y18249986D02*
X15887500Y18242845D01*
X15873218Y18221420D01*
X15866077Y18185715D01*
Y18164290D01*
X15873218Y18128584D01*
X15887500Y18107159D01*
X15908923Y18100018D01*
X15923207D01*
X15944630Y18107159D01*
X15958914Y18128584D01*
X15966055Y18164290D01*
Y18185715D01*
X15958914Y18221420D01*
X15944630Y18242845D01*
X15923207Y18249986D01*
X15908923D01*
X16117451Y18164290D02*
X16245995D01*
X16333119Y18249986D02*
X16311694Y18242845D01*
X16297412Y18221420D01*
X16290271Y18185715D01*
Y18164290D01*
X16297412Y18128584D01*
X16311694Y18107159D01*
X16333119Y18100018D01*
X16347401D01*
X16368826Y18107159D01*
X16383109Y18128584D01*
X16390250Y18164290D01*
Y18185715D01*
X16383109Y18221420D01*
X16368826Y18242845D01*
X16347401Y18249986D01*
X16333119D01*
X16430956Y18114301D02*
X16423814Y18107159D01*
X16430956Y18100018D01*
X16438097Y18107159D01*
X16430956Y18114301D01*
X16485229Y18249986D02*
X16563783D01*
X16520937Y18192854D01*
X16542360D01*
X16556644Y18185715D01*
X16563783Y18178574D01*
X16570924Y18157149D01*
Y18142867D01*
X16563783Y18121442D01*
X16549501Y18107159D01*
X16528078Y18100018D01*
X16506653D01*
X16485229Y18107159D01*
X16478088Y18114301D01*
X16470947Y18128584D01*
X24122580Y11669137D02*
X24115439Y11683419D01*
X24094016Y11704843D01*
X24243983D01*
X24094016Y11821961D02*
X24101157Y11800537D01*
X24122580Y11786254D01*
X24158287Y11779113D01*
X24179710D01*
X24215417Y11786254D01*
X24236842Y11800537D01*
X24243983Y11821961D01*
Y11836244D01*
X24236842Y11857668D01*
X24215417Y11871950D01*
X24179710Y11879092D01*
X24158287D01*
X24122580Y11871950D01*
X24101157Y11857668D01*
X24094016Y11836244D01*
Y11821961D01*
Y11955504D02*
X24101157Y11934080D01*
X24122580Y11919797D01*
X24158287Y11912656D01*
X24179710D01*
X24215417Y11919797D01*
X24236842Y11934080D01*
X24243983Y11955504D01*
Y11969787D01*
X24236842Y11991210D01*
X24215417Y12005493D01*
X24179710Y12012634D01*
X24158287D01*
X24122580Y12005493D01*
X24101157Y11991210D01*
X24094016Y11969787D01*
Y11955504D01*
X24229700Y12053340D02*
X24236842Y12046199D01*
X24243983Y12053340D01*
X24236842Y12060481D01*
X24229700Y12053340D01*
X24094016Y12136179D02*
X24101157Y12114755D01*
X24122580Y12100473D01*
X24158287Y12093331D01*
X24179710D01*
X24215417Y12100473D01*
X24236842Y12114755D01*
X24243983Y12136179D01*
Y12150462D01*
X24236842Y12171886D01*
X24215417Y12186169D01*
X24179710Y12193310D01*
X24158287D01*
X24122580Y12186169D01*
X24101157Y12171886D01*
X24094016Y12150462D01*
Y12136179D01*
X24144003Y12226874D02*
X24243983D01*
X24172569D02*
X24151144Y12248298D01*
X24144003Y12262581D01*
Y12284005D01*
X24151144Y12298288D01*
X24172569Y12305429D01*
X24243983D01*
X24172569D02*
X24151144Y12326853D01*
X24144003Y12341135D01*
Y12362559D01*
X24151144Y12376842D01*
X24172569Y12383983D01*
X24243983D01*
X24144003Y12431116D02*
X24243983D01*
X24172569D02*
X24151144Y12452540D01*
X24144003Y12466823D01*
Y12488247D01*
X24151144Y12502529D01*
X24172569Y12509671D01*
X24243983D01*
X24172569D02*
X24151144Y12531095D01*
X24144003Y12545377D01*
Y12566801D01*
X24151144Y12581084D01*
X24172569Y12588225D01*
X24243983D01*
X24115439Y12817462D02*
X24243983D01*
X24179710Y12753190D02*
Y12881734D01*
X24094016Y12968858D02*
X24101157Y12947433D01*
X24122580Y12933151D01*
X24158287Y12926010D01*
X24179710D01*
X24215417Y12933151D01*
X24236842Y12947433D01*
X24243983Y12968858D01*
Y12983141D01*
X24236842Y13004565D01*
X24215417Y13018848D01*
X24179710Y13025987D01*
X24158287D01*
X24122580Y13018848D01*
X24101157Y13004565D01*
X24094016Y12983141D01*
Y12968858D01*
X24179710Y13177385D02*
Y13305928D01*
X24094016Y13393053D02*
X24101157Y13371629D01*
X24122580Y13357346D01*
X24158287Y13350204D01*
X24179710D01*
X24215417Y13357346D01*
X24236842Y13371629D01*
X24243983Y13393053D01*
Y13407335D01*
X24236842Y13428758D01*
X24215417Y13443042D01*
X24179710Y13450183D01*
X24158287D01*
X24122580Y13443042D01*
X24101157Y13428758D01*
X24094016Y13407335D01*
Y13393053D01*
X24229700Y13490889D02*
X24236842Y13483746D01*
X24243983Y13490889D01*
X24236842Y13498030D01*
X24229700Y13490889D01*
X24094016Y13545163D02*
Y13623717D01*
X24151144Y13580869D01*
Y13602293D01*
X24158287Y13616576D01*
X24165428Y13623717D01*
X24186852Y13630859D01*
X24201135D01*
X24222559Y13623717D01*
X24236842Y13609435D01*
X24243983Y13588011D01*
Y13566586D01*
X24236842Y13545163D01*
X24229700Y13538020D01*
X24215417Y13530881D01*
%TF.MD5,b004a09696fedfff4c88fb67c824db71*%
M02*
