G04*
G04 #@! TF.GenerationSoftware,Altium Limited,Altium Designer,19.1.5 (86)*
G04*
G04 Layer_Physical_Order=1*
G04 Layer_Color=255*
%FSLAX44Y44*%
%MOMM*%
G71*
G01*
G75*
%ADD12C,0.2540*%
%ADD14C,0.1778*%
%ADD15C,1.6000*%
%ADD16C,1.5000*%
%ADD17C,3.7500*%
%ADD18C,1.9000*%
%ADD20C,1.7000*%
%ADD21C,3.5000*%
%ADD22C,2.0000*%
%ADD23R,1.6000X1.6000*%
%ADD24C,4.4500*%
%ADD25C,0.6096*%
%ADD26C,1.2700*%
%ADD27C,0.5000*%
G36*
X937497Y1600701D02*
Y1544320D01*
X802640D01*
Y1348740D01*
X937497D01*
Y1293750D01*
X936599Y1292852D01*
X812800Y1292866D01*
Y1165595D01*
X810239Y1165257D01*
X807853Y1164269D01*
X805803Y1162697D01*
X804231Y1160647D01*
X803242Y1158261D01*
X802905Y1155700D01*
X803242Y1153139D01*
X804231Y1150753D01*
X805803Y1148703D01*
X807853Y1147131D01*
X810239Y1146143D01*
X812800Y1145805D01*
Y1114795D01*
X810239Y1114457D01*
X807853Y1113469D01*
X805803Y1111897D01*
X804231Y1109847D01*
X803242Y1107461D01*
X802905Y1104900D01*
X803242Y1102339D01*
X804231Y1099953D01*
X805803Y1097903D01*
X807853Y1096331D01*
X810239Y1095342D01*
X812800Y1095005D01*
Y1063995D01*
X810239Y1063658D01*
X807853Y1062669D01*
X805803Y1061097D01*
X804231Y1059047D01*
X803242Y1056661D01*
X802905Y1054100D01*
X803242Y1051539D01*
X804231Y1049153D01*
X805803Y1047103D01*
X807853Y1045531D01*
X810239Y1044542D01*
X812800Y1044205D01*
Y1013195D01*
X810239Y1012858D01*
X807853Y1011869D01*
X805803Y1010297D01*
X804231Y1008247D01*
X803242Y1005861D01*
X802905Y1003300D01*
X803242Y1000739D01*
X804231Y998353D01*
X805803Y996303D01*
X807853Y994731D01*
X810239Y993743D01*
X812800Y993405D01*
Y970280D01*
X850900D01*
Y774904D01*
X769303D01*
Y1765096D01*
X937497D01*
Y1600701D01*
D02*
G37*
G36*
X2306318Y1684021D02*
X2349498D01*
X2349499Y858521D01*
X2306318Y858520D01*
X2306318Y787400D01*
X858586Y787401D01*
Y970280D01*
X858324Y972269D01*
X857556Y974123D01*
X856335Y975715D01*
X854743Y976936D01*
X852889Y977704D01*
X850900Y977966D01*
X845199D01*
X844536Y979377D01*
X844353Y981066D01*
X846266Y982534D01*
X847148Y983683D01*
X897202D01*
X898357Y982177D01*
X900824Y980284D01*
X903697Y979094D01*
X906780Y978688D01*
X909863Y979094D01*
X912736Y980284D01*
X915203Y982177D01*
X917096Y984644D01*
X918286Y987517D01*
X918692Y990600D01*
X918286Y993683D01*
X917096Y996556D01*
X915203Y999023D01*
X912736Y1000916D01*
X909863Y1002106D01*
X906780Y1002512D01*
X903697Y1002106D01*
X900824Y1000916D01*
X898357Y999023D01*
X897202Y997517D01*
X847148D01*
X846266Y998666D01*
X843904Y1000479D01*
X841152Y1001619D01*
X838200Y1002008D01*
X835247Y1001619D01*
X832496Y1000479D01*
X830134Y998666D01*
X828321Y996304D01*
X827181Y993552D01*
X826793Y990600D01*
X827181Y987647D01*
X828321Y984896D01*
X830134Y982534D01*
X832047Y981066D01*
X831864Y979377D01*
X831201Y977966D01*
X820486D01*
Y993405D01*
X820420Y993905D01*
Y994408D01*
X820420Y994409D01*
Y997116D01*
X821369Y998353D01*
X822357Y1000739D01*
X822695Y1003300D01*
X822357Y1005861D01*
X821369Y1008247D01*
X820420Y1009484D01*
Y1012191D01*
X820420Y1012191D01*
Y1012695D01*
X820486Y1013195D01*
Y1044205D01*
X820420Y1044705D01*
Y1045209D01*
X820420Y1045209D01*
Y1047916D01*
X821369Y1049153D01*
X822357Y1051539D01*
X822695Y1054100D01*
X822357Y1056661D01*
X821369Y1059047D01*
X820420Y1060284D01*
Y1062991D01*
X820420Y1062991D01*
Y1063495D01*
X820486Y1063995D01*
Y1095005D01*
X820420Y1095505D01*
Y1096009D01*
X820420Y1096009D01*
Y1098716D01*
X821369Y1099953D01*
X822357Y1102339D01*
X822695Y1104900D01*
X822357Y1107461D01*
X821369Y1109847D01*
X820420Y1111084D01*
Y1113791D01*
X820420Y1113792D01*
Y1114295D01*
X820486Y1114795D01*
Y1145805D01*
X820420Y1146305D01*
Y1146808D01*
X820420Y1146809D01*
Y1149516D01*
X821369Y1150753D01*
X822357Y1153139D01*
X822695Y1155700D01*
X822357Y1158261D01*
X821369Y1160647D01*
X820420Y1161884D01*
Y1164591D01*
X820420Y1164592D01*
Y1165095D01*
X820486Y1165595D01*
Y1282988D01*
X822678Y1285179D01*
X936598Y1285167D01*
X936598Y1285167D01*
X936599Y1285167D01*
X937675Y1285308D01*
X938587Y1285428D01*
X938587Y1285428D01*
X938588Y1285428D01*
X939690Y1285885D01*
X940441Y1286196D01*
X940441Y1286196D01*
X940442Y1286196D01*
X941327Y1286876D01*
X942033Y1287417D01*
X942033Y1287417D01*
X942033Y1287417D01*
X942931Y1288315D01*
X942932Y1288316D01*
X942932Y1288316D01*
X943414Y1288944D01*
X944153Y1289907D01*
X944153Y1289908D01*
X944153Y1289908D01*
X944462Y1290652D01*
X944921Y1291761D01*
X944921Y1291761D01*
X944921Y1291761D01*
X945066Y1292860D01*
X945183Y1293750D01*
X945183Y1293750D01*
X945183Y1293750D01*
Y1348740D01*
X944921Y1350729D01*
X944153Y1352583D01*
X943094Y1353963D01*
X943264Y1354897D01*
X944260Y1357063D01*
X1170615D01*
X1402783Y1124895D01*
Y1036320D01*
X1403018Y1034530D01*
X1403710Y1032861D01*
X1404809Y1031429D01*
X1442909Y993329D01*
X1444341Y992230D01*
X1446010Y991538D01*
X1447800Y991303D01*
X1475415D01*
X1499636Y967082D01*
X1499388Y965200D01*
X1499794Y962117D01*
X1500984Y959244D01*
X1502877Y956777D01*
X1504383Y955622D01*
Y936678D01*
X1502877Y935523D01*
X1500984Y933056D01*
X1500270Y931332D01*
X1496930D01*
X1496216Y933056D01*
X1494323Y935523D01*
X1491856Y937416D01*
X1488983Y938606D01*
X1485900Y939012D01*
X1482817Y938606D01*
X1479944Y937416D01*
X1477477Y935523D01*
X1475584Y933056D01*
X1474870Y931332D01*
X1471530D01*
X1470816Y933056D01*
X1468923Y935523D01*
X1466456Y937416D01*
X1463583Y938606D01*
X1460500Y939012D01*
X1457417Y938606D01*
X1454544Y937416D01*
X1452077Y935523D01*
X1450184Y933056D01*
X1448994Y930183D01*
X1448588Y927100D01*
X1448994Y924017D01*
X1450184Y921144D01*
X1452077Y918677D01*
X1454544Y916784D01*
X1457417Y915594D01*
X1460500Y915188D01*
X1463583Y915594D01*
X1466456Y916784D01*
X1468923Y918677D01*
X1470816Y921144D01*
X1471530Y922868D01*
X1474870D01*
X1475584Y921144D01*
X1477477Y918677D01*
X1479944Y916784D01*
X1482817Y915594D01*
X1485900Y915188D01*
X1488983Y915594D01*
X1491856Y916784D01*
X1494323Y918677D01*
X1496216Y921144D01*
X1496930Y922868D01*
X1500270D01*
X1500984Y921144D01*
X1502877Y918677D01*
X1505344Y916784D01*
X1508217Y915594D01*
X1511300Y915188D01*
X1514383Y915594D01*
X1517256Y916784D01*
X1519723Y918677D01*
X1521616Y921144D01*
X1522806Y924017D01*
X1523212Y927100D01*
X1522806Y930183D01*
X1521616Y933056D01*
X1519723Y935523D01*
X1518217Y936678D01*
Y955622D01*
X1519723Y956777D01*
X1521616Y959244D01*
X1522806Y962117D01*
X1523212Y965200D01*
X1522806Y968283D01*
X1521616Y971156D01*
X1519723Y973623D01*
X1517256Y975516D01*
X1514383Y976706D01*
X1511300Y977112D01*
X1509418Y976864D01*
X1483171Y1003111D01*
X1481739Y1004211D01*
X1480070Y1004902D01*
X1478280Y1005137D01*
X1450665D01*
X1416617Y1039185D01*
Y1127760D01*
X1416382Y1129550D01*
X1415690Y1131219D01*
X1414591Y1132651D01*
X1305040Y1242203D01*
X1306324Y1245303D01*
X1467795D01*
X1500884Y1212214D01*
X1499794Y1209583D01*
X1499388Y1206500D01*
X1499794Y1203417D01*
X1500984Y1200544D01*
X1502877Y1198077D01*
X1504383Y1196922D01*
Y1177978D01*
X1502877Y1176823D01*
X1500984Y1174356D01*
X1500270Y1172632D01*
X1496930D01*
X1496216Y1174356D01*
X1494323Y1176823D01*
X1491856Y1178716D01*
X1488983Y1179906D01*
X1485900Y1180312D01*
X1482817Y1179906D01*
X1479944Y1178716D01*
X1477477Y1176823D01*
X1475584Y1174356D01*
X1474870Y1172632D01*
X1471530D01*
X1470816Y1174356D01*
X1468923Y1176823D01*
X1466456Y1178716D01*
X1463583Y1179906D01*
X1460500Y1180312D01*
X1457417Y1179906D01*
X1454544Y1178716D01*
X1452077Y1176823D01*
X1450184Y1174356D01*
X1448994Y1171483D01*
X1448588Y1168400D01*
X1448994Y1165317D01*
X1450184Y1162444D01*
X1452077Y1159977D01*
X1454544Y1158084D01*
X1457417Y1156894D01*
X1460500Y1156488D01*
X1463583Y1156894D01*
X1466456Y1158084D01*
X1468923Y1159977D01*
X1470816Y1162444D01*
X1471530Y1164168D01*
X1474870D01*
X1475584Y1162444D01*
X1477477Y1159977D01*
X1479944Y1158084D01*
X1482817Y1156894D01*
X1485900Y1156488D01*
X1488983Y1156894D01*
X1491856Y1158084D01*
X1494323Y1159977D01*
X1496216Y1162444D01*
X1496930Y1164168D01*
X1500270D01*
X1500984Y1162444D01*
X1502877Y1159977D01*
X1505344Y1158084D01*
X1508217Y1156894D01*
X1511300Y1156488D01*
X1514383Y1156894D01*
X1517256Y1158084D01*
X1519723Y1159977D01*
X1521616Y1162444D01*
X1522806Y1165317D01*
X1523212Y1168400D01*
X1522806Y1171483D01*
X1521616Y1174356D01*
X1519723Y1176823D01*
X1518217Y1177978D01*
Y1196922D01*
X1519723Y1198077D01*
X1521616Y1200544D01*
X1522806Y1203417D01*
X1523212Y1206500D01*
X1522806Y1209583D01*
X1521616Y1212456D01*
X1519723Y1214923D01*
X1517256Y1216816D01*
X1514850Y1217813D01*
X1475551Y1257111D01*
X1474119Y1258211D01*
X1472450Y1258902D01*
X1470660Y1259137D01*
X1305885D01*
X1183451Y1381571D01*
X1182019Y1382670D01*
X1180350Y1383362D01*
X1178560Y1383597D01*
X938835D01*
X934401Y1388031D01*
X934825Y1391250D01*
X934367Y1394724D01*
X933026Y1397962D01*
X930893Y1400743D01*
X928317Y1402719D01*
Y1407481D01*
X930893Y1409457D01*
X933026Y1412238D01*
X934367Y1415475D01*
X934825Y1418950D01*
X934367Y1422425D01*
X933026Y1425662D01*
X930893Y1428443D01*
X928317Y1430419D01*
Y1435181D01*
X930893Y1437157D01*
X933026Y1439938D01*
X934367Y1443175D01*
X934825Y1446650D01*
X934367Y1450125D01*
X933026Y1453362D01*
X930893Y1456143D01*
X928317Y1458119D01*
Y1462881D01*
X930893Y1464857D01*
X933026Y1467638D01*
X934367Y1470875D01*
X934825Y1474350D01*
X934367Y1477825D01*
X933026Y1481062D01*
X930893Y1483843D01*
X928112Y1485976D01*
X926794Y1486522D01*
Y1489878D01*
X928112Y1490424D01*
X930893Y1492557D01*
X933026Y1495338D01*
X934367Y1498575D01*
X934825Y1502050D01*
X934367Y1505525D01*
X933026Y1508762D01*
X930893Y1511543D01*
X928112Y1513676D01*
X924875Y1515017D01*
X921400Y1515475D01*
X917925Y1515017D01*
X914688Y1513676D01*
X911907Y1511543D01*
X909774Y1508762D01*
X908433Y1505525D01*
X907975Y1502050D01*
X908433Y1498575D01*
X909774Y1495338D01*
X911907Y1492557D01*
X914688Y1490424D01*
X916006Y1489878D01*
Y1486522D01*
X914688Y1485976D01*
X911907Y1483843D01*
X909774Y1481062D01*
X908433Y1477825D01*
X907975Y1474350D01*
X908433Y1470875D01*
X909774Y1467638D01*
X911907Y1464857D01*
X914483Y1462881D01*
Y1458119D01*
X911907Y1456143D01*
X909774Y1453362D01*
X908433Y1450125D01*
X907975Y1446650D01*
X908433Y1443175D01*
X909774Y1439938D01*
X911907Y1437157D01*
X914483Y1435181D01*
Y1430419D01*
X911907Y1428443D01*
X909774Y1425662D01*
X908433Y1422425D01*
X907975Y1418950D01*
X908433Y1415475D01*
X909774Y1412238D01*
X911907Y1409457D01*
X914483Y1407481D01*
Y1402719D01*
X911907Y1400743D01*
X909774Y1397962D01*
X908433Y1394724D01*
X907975Y1391250D01*
X908433Y1387775D01*
X909774Y1384538D01*
X911907Y1381757D01*
X914688Y1379624D01*
X917925Y1378282D01*
X921400Y1377825D01*
X924619Y1378249D01*
X928870Y1373997D01*
X927586Y1370897D01*
X917265D01*
X899917Y1388245D01*
Y1393631D01*
X902493Y1395607D01*
X904626Y1398387D01*
X905967Y1401625D01*
X906425Y1405100D01*
X905967Y1408575D01*
X904626Y1411812D01*
X902493Y1414593D01*
X899917Y1416569D01*
Y1421331D01*
X902493Y1423307D01*
X904626Y1426087D01*
X905967Y1429325D01*
X906425Y1432800D01*
X905967Y1436275D01*
X904626Y1439512D01*
X902493Y1442293D01*
X899917Y1444269D01*
Y1449031D01*
X902493Y1451007D01*
X904626Y1453788D01*
X905967Y1457025D01*
X906425Y1460500D01*
X905967Y1463975D01*
X904626Y1467212D01*
X902493Y1469993D01*
X899712Y1472126D01*
X896475Y1473467D01*
X893000Y1473925D01*
X889525Y1473467D01*
X886288Y1472126D01*
X883507Y1469993D01*
X881374Y1467212D01*
X880033Y1463975D01*
X879575Y1460500D01*
X880033Y1457025D01*
X881374Y1453788D01*
X883507Y1451007D01*
X886083Y1449031D01*
Y1444269D01*
X883507Y1442293D01*
X881374Y1439512D01*
X880033Y1436275D01*
X879575Y1432800D01*
X880033Y1429325D01*
X881374Y1426087D01*
X883507Y1423307D01*
X886083Y1421331D01*
Y1416569D01*
X883507Y1414593D01*
X881374Y1411812D01*
X880033Y1408575D01*
X879575Y1405100D01*
X880033Y1401625D01*
X881374Y1398387D01*
X883507Y1395607D01*
X886083Y1393631D01*
Y1385380D01*
X886319Y1383590D01*
X887010Y1381921D01*
X888109Y1380489D01*
X909072Y1359526D01*
X908730Y1357809D01*
X907887Y1356426D01*
X810326D01*
Y1398852D01*
X813426Y1399469D01*
X813874Y1398388D01*
X816007Y1395607D01*
X818788Y1393474D01*
X822025Y1392133D01*
X825500Y1391675D01*
X828975Y1392133D01*
X832212Y1393474D01*
X834993Y1395607D01*
X837126Y1398388D01*
X838467Y1401625D01*
X838925Y1405100D01*
X838467Y1408575D01*
X837126Y1411812D01*
X834993Y1414593D01*
X832212Y1416726D01*
X830894Y1417272D01*
Y1420628D01*
X832212Y1421174D01*
X834993Y1423307D01*
X837126Y1426088D01*
X838467Y1429325D01*
X838925Y1432800D01*
X838467Y1436275D01*
X837126Y1439512D01*
X834993Y1442293D01*
X832212Y1444426D01*
X830894Y1444972D01*
Y1448328D01*
X832212Y1448874D01*
X834993Y1451007D01*
X837126Y1453788D01*
X838467Y1457025D01*
X838925Y1460500D01*
X838467Y1463975D01*
X837126Y1467212D01*
X834993Y1469993D01*
X832212Y1472126D01*
X828975Y1473467D01*
X825500Y1473925D01*
X822025Y1473467D01*
X818788Y1472126D01*
X816007Y1469993D01*
X813874Y1467212D01*
X813426Y1466131D01*
X810326Y1466747D01*
Y1536634D01*
X937497D01*
X939486Y1536896D01*
X941340Y1537664D01*
X942932Y1538885D01*
X944153Y1540477D01*
X944921Y1542331D01*
X945183Y1544320D01*
Y1600701D01*
Y1757680D01*
X2306318Y1757680D01*
Y1684021D01*
D02*
G37*
%LPC*%
G36*
X1651000Y1716252D02*
X1647917Y1715846D01*
X1645044Y1714656D01*
X1642577Y1712763D01*
X1640684Y1710296D01*
X1639494Y1707423D01*
X1639088Y1704340D01*
X1639494Y1701257D01*
X1640684Y1698384D01*
X1642577Y1695917D01*
X1644083Y1694762D01*
Y1675188D01*
X1642934Y1674306D01*
X1641121Y1671944D01*
X1639981Y1669193D01*
X1639592Y1666240D01*
X1639981Y1663288D01*
X1641121Y1660536D01*
X1642934Y1658174D01*
X1645296Y1656361D01*
X1648047Y1655221D01*
X1651000Y1654832D01*
X1653952Y1655221D01*
X1656704Y1656361D01*
X1659066Y1658174D01*
X1660879Y1660536D01*
X1662019Y1663288D01*
X1662408Y1666240D01*
X1662019Y1669193D01*
X1660879Y1671944D01*
X1659066Y1674306D01*
X1657917Y1675188D01*
Y1694762D01*
X1659423Y1695917D01*
X1660578Y1697423D01*
X1724335D01*
X1726899Y1694859D01*
X1726475Y1691640D01*
X1726933Y1688165D01*
X1728274Y1684928D01*
X1730407Y1682147D01*
X1733188Y1680014D01*
X1736425Y1678673D01*
X1739900Y1678215D01*
X1743375Y1678673D01*
X1746612Y1680014D01*
X1749393Y1682147D01*
X1751526Y1684928D01*
X1752867Y1688165D01*
X1753325Y1691640D01*
X1752867Y1695115D01*
X1751526Y1698352D01*
X1749393Y1701133D01*
X1746612Y1703266D01*
X1743375Y1704607D01*
X1739900Y1705065D01*
X1736681Y1704641D01*
X1732091Y1709231D01*
X1730659Y1710331D01*
X1728990Y1711022D01*
X1727200Y1711257D01*
X1660578D01*
X1659423Y1712763D01*
X1656956Y1714656D01*
X1654083Y1715846D01*
X1651000Y1716252D01*
D02*
G37*
G36*
X2311400Y1676116D02*
X2308186Y1675693D01*
X2305192Y1674453D01*
X2302620Y1672480D01*
X2301191Y1670617D01*
X2270809D01*
X2269379Y1672480D01*
X2266808Y1674453D01*
X2263813Y1675693D01*
X2260600Y1676116D01*
X2257386Y1675693D01*
X2254392Y1674453D01*
X2251820Y1672480D01*
X2250391Y1670617D01*
X1813560D01*
X1811770Y1670382D01*
X1810102Y1669691D01*
X1808669Y1668591D01*
X1743119Y1603041D01*
X1739900Y1603465D01*
X1736425Y1603007D01*
X1733188Y1601666D01*
X1730407Y1599533D01*
X1728431Y1596957D01*
X1679265D01*
X1662218Y1614004D01*
X1662408Y1615440D01*
X1662019Y1618392D01*
X1660879Y1621144D01*
X1659066Y1623506D01*
X1656704Y1625319D01*
X1653952Y1626459D01*
X1651000Y1626848D01*
X1648047Y1626459D01*
X1645296Y1625319D01*
X1642934Y1623506D01*
X1641121Y1621144D01*
X1639981Y1618392D01*
X1639592Y1615440D01*
X1639781Y1614004D01*
X1584635Y1558857D01*
X1571678D01*
X1570523Y1560363D01*
X1568056Y1562256D01*
X1565183Y1563446D01*
X1562100Y1563852D01*
X1559017Y1563446D01*
X1556144Y1562256D01*
X1553677Y1560363D01*
X1551784Y1557896D01*
X1550594Y1555023D01*
X1550188Y1551940D01*
X1550594Y1548857D01*
X1551784Y1545984D01*
X1553677Y1543517D01*
X1556144Y1541624D01*
X1559017Y1540434D01*
X1562100Y1540028D01*
X1565183Y1540434D01*
X1568056Y1541624D01*
X1570523Y1543517D01*
X1571678Y1545023D01*
X1587500D01*
X1589290Y1545258D01*
X1590959Y1545950D01*
X1592391Y1547049D01*
X1649564Y1604221D01*
X1651000Y1604032D01*
X1652436Y1604221D01*
X1671509Y1585149D01*
X1672941Y1584050D01*
X1674610Y1583358D01*
X1676400Y1583123D01*
X1728431D01*
X1730407Y1580547D01*
X1733188Y1578414D01*
X1736425Y1577073D01*
X1739900Y1576615D01*
X1743375Y1577073D01*
X1746612Y1578414D01*
X1749393Y1580547D01*
X1751526Y1583328D01*
X1752867Y1586565D01*
X1753325Y1590040D01*
X1752901Y1593259D01*
X1816425Y1656783D01*
X2250391D01*
X2251820Y1654921D01*
X2254392Y1652947D01*
X2255043Y1652678D01*
Y1649323D01*
X2254392Y1649053D01*
X2251820Y1647080D01*
X2250391Y1645217D01*
X2032000D01*
X2030210Y1644982D01*
X2028542Y1644291D01*
X2027109Y1643191D01*
X1743119Y1359201D01*
X1739900Y1359625D01*
X1736425Y1359167D01*
X1733188Y1357826D01*
X1730407Y1355693D01*
X1728431Y1353117D01*
X1679265D01*
X1662218Y1370164D01*
X1662408Y1371600D01*
X1662019Y1374552D01*
X1660879Y1377304D01*
X1659066Y1379666D01*
X1656704Y1381479D01*
X1653952Y1382619D01*
X1651000Y1383008D01*
X1648047Y1382619D01*
X1645296Y1381479D01*
X1642934Y1379666D01*
X1641121Y1377304D01*
X1639981Y1374552D01*
X1639592Y1371600D01*
X1639781Y1370164D01*
X1584635Y1315017D01*
X1571678D01*
X1570523Y1316523D01*
X1568056Y1318416D01*
X1565183Y1319606D01*
X1562100Y1320012D01*
X1559017Y1319606D01*
X1556144Y1318416D01*
X1553677Y1316523D01*
X1551784Y1314056D01*
X1550594Y1311183D01*
X1550188Y1308100D01*
X1550594Y1305017D01*
X1551784Y1302144D01*
X1553677Y1299677D01*
X1556144Y1297784D01*
X1559017Y1296594D01*
X1562100Y1296188D01*
X1565183Y1296594D01*
X1568056Y1297784D01*
X1570523Y1299677D01*
X1571678Y1301183D01*
X1587500D01*
X1589290Y1301418D01*
X1590959Y1302110D01*
X1592391Y1303209D01*
X1649564Y1360381D01*
X1651000Y1360192D01*
X1652436Y1360381D01*
X1671509Y1341309D01*
X1672941Y1340210D01*
X1674610Y1339518D01*
X1676400Y1339283D01*
X1728431D01*
X1730407Y1336707D01*
X1733188Y1334574D01*
X1736425Y1333233D01*
X1739900Y1332775D01*
X1743375Y1333233D01*
X1746612Y1334574D01*
X1749393Y1336707D01*
X1751526Y1339488D01*
X1752867Y1342725D01*
X1753325Y1346200D01*
X1752901Y1349419D01*
X2034865Y1631383D01*
X2250391D01*
X2251820Y1629521D01*
X2254392Y1627547D01*
X2255043Y1627278D01*
Y1623922D01*
X2254392Y1623653D01*
X2251820Y1621680D01*
X2250391Y1619817D01*
X2034540D01*
X2032750Y1619582D01*
X2031082Y1618891D01*
X2029649Y1617791D01*
X1806129Y1394271D01*
X1805029Y1392839D01*
X1804339Y1391170D01*
X1804103Y1389380D01*
Y1166185D01*
X1743119Y1105201D01*
X1739900Y1105625D01*
X1736425Y1105167D01*
X1733188Y1103826D01*
X1730407Y1101693D01*
X1728431Y1099117D01*
X1679265D01*
X1662218Y1116164D01*
X1662408Y1117600D01*
X1662019Y1120553D01*
X1660879Y1123304D01*
X1659066Y1125666D01*
X1656704Y1127479D01*
X1653952Y1128619D01*
X1651000Y1129007D01*
X1648047Y1128619D01*
X1645296Y1127479D01*
X1642934Y1125666D01*
X1641121Y1123304D01*
X1639981Y1120553D01*
X1639592Y1117600D01*
X1639781Y1116164D01*
X1584635Y1061017D01*
X1571678D01*
X1570523Y1062523D01*
X1568056Y1064416D01*
X1565183Y1065606D01*
X1562100Y1066012D01*
X1559017Y1065606D01*
X1556144Y1064416D01*
X1553677Y1062523D01*
X1551784Y1060056D01*
X1550594Y1057183D01*
X1550188Y1054100D01*
X1550594Y1051017D01*
X1551784Y1048144D01*
X1553677Y1045677D01*
X1556144Y1043784D01*
X1559017Y1042594D01*
X1562100Y1042188D01*
X1565183Y1042594D01*
X1568056Y1043784D01*
X1570523Y1045677D01*
X1571678Y1047183D01*
X1587500D01*
X1589290Y1047419D01*
X1590959Y1048110D01*
X1592391Y1049209D01*
X1649564Y1106382D01*
X1651000Y1106192D01*
X1652436Y1106382D01*
X1671509Y1087309D01*
X1672941Y1086209D01*
X1674610Y1085518D01*
X1676400Y1085283D01*
X1728431D01*
X1730407Y1082707D01*
X1733188Y1080574D01*
X1736425Y1079233D01*
X1739900Y1078775D01*
X1743375Y1079233D01*
X1746612Y1080574D01*
X1749393Y1082707D01*
X1751526Y1085488D01*
X1752867Y1088725D01*
X1753325Y1092200D01*
X1752901Y1095419D01*
X1815911Y1158429D01*
X1817010Y1159861D01*
X1817702Y1161530D01*
X1817937Y1163320D01*
Y1386515D01*
X2037405Y1605983D01*
X2250391D01*
X2251820Y1604121D01*
X2254392Y1602147D01*
X2255043Y1601878D01*
Y1598522D01*
X2254392Y1598253D01*
X2251820Y1596280D01*
X2250391Y1594417D01*
X2037080D01*
X2035290Y1594182D01*
X2033622Y1593491D01*
X2032189Y1592391D01*
X1826449Y1386651D01*
X1825349Y1385219D01*
X1824659Y1383550D01*
X1824423Y1381760D01*
X1824423Y945205D01*
X1743119Y863901D01*
X1739900Y864325D01*
X1736425Y863867D01*
X1733188Y862526D01*
X1730407Y860393D01*
X1728431Y857817D01*
X1679265D01*
X1662218Y874864D01*
X1662408Y876300D01*
X1662019Y879252D01*
X1660879Y882004D01*
X1659066Y884366D01*
X1656704Y886179D01*
X1653952Y887319D01*
X1651000Y887708D01*
X1648047Y887319D01*
X1645296Y886179D01*
X1642934Y884366D01*
X1641121Y882004D01*
X1639981Y879252D01*
X1639592Y876300D01*
X1639781Y874864D01*
X1584635Y819717D01*
X1571678D01*
X1570523Y821223D01*
X1568056Y823116D01*
X1565183Y824306D01*
X1562100Y824712D01*
X1559017Y824306D01*
X1556144Y823116D01*
X1553677Y821223D01*
X1551784Y818756D01*
X1550594Y815883D01*
X1550188Y812800D01*
X1550594Y809717D01*
X1551784Y806844D01*
X1553677Y804377D01*
X1556144Y802484D01*
X1559017Y801294D01*
X1562100Y800888D01*
X1565183Y801294D01*
X1568056Y802484D01*
X1570523Y804377D01*
X1571678Y805883D01*
X1587500D01*
X1589290Y806118D01*
X1590959Y806809D01*
X1592391Y807909D01*
X1649564Y865081D01*
X1651000Y864892D01*
X1652436Y865081D01*
X1671509Y846009D01*
X1672941Y844910D01*
X1674610Y844219D01*
X1676400Y843983D01*
X1728431D01*
X1730407Y841407D01*
X1733188Y839274D01*
X1736425Y837933D01*
X1739900Y837475D01*
X1743375Y837933D01*
X1746612Y839274D01*
X1749393Y841407D01*
X1751526Y844188D01*
X1752867Y847425D01*
X1753325Y850900D01*
X1752901Y854119D01*
X1836231Y937449D01*
X1837330Y938881D01*
X1838022Y940550D01*
X1838257Y942340D01*
X1838257Y1378895D01*
X2039945Y1580583D01*
X2250391D01*
X2251820Y1578721D01*
X2254392Y1576747D01*
X2255043Y1576478D01*
Y1573123D01*
X2254392Y1572853D01*
X2251820Y1570880D01*
X2249847Y1568308D01*
X2248607Y1565314D01*
X2248184Y1562100D01*
X2248607Y1558887D01*
X2249847Y1555892D01*
X2251820Y1553321D01*
X2254392Y1551347D01*
X2255043Y1551078D01*
Y1547722D01*
X2254392Y1547453D01*
X2251820Y1545480D01*
X2249847Y1542908D01*
X2248607Y1539914D01*
X2248184Y1536700D01*
X2248607Y1533487D01*
X2249847Y1530492D01*
X2251820Y1527921D01*
X2254392Y1525947D01*
X2255043Y1525678D01*
Y1522323D01*
X2254392Y1522053D01*
X2251820Y1520080D01*
X2249847Y1517508D01*
X2248607Y1514514D01*
X2248184Y1511300D01*
X2248607Y1508087D01*
X2249847Y1505092D01*
X2251820Y1502521D01*
X2254392Y1500547D01*
X2255043Y1500278D01*
Y1496922D01*
X2254392Y1496653D01*
X2251820Y1494680D01*
X2249847Y1492108D01*
X2248607Y1489114D01*
X2248184Y1485900D01*
X2248607Y1482687D01*
X2249847Y1479692D01*
X2251820Y1477121D01*
X2254392Y1475147D01*
X2255043Y1474878D01*
Y1471523D01*
X2254392Y1471253D01*
X2251820Y1469280D01*
X2249847Y1466708D01*
X2248607Y1463714D01*
X2248184Y1460500D01*
X2248607Y1457287D01*
X2249847Y1454292D01*
X2251820Y1451721D01*
X2254392Y1449747D01*
X2255043Y1449478D01*
Y1446122D01*
X2254392Y1445853D01*
X2251820Y1443880D01*
X2249847Y1441308D01*
X2248607Y1438314D01*
X2248184Y1435100D01*
X2248607Y1431887D01*
X2249847Y1428892D01*
X2251820Y1426321D01*
X2254392Y1424347D01*
X2255043Y1424078D01*
Y1420723D01*
X2254392Y1420453D01*
X2251820Y1418480D01*
X2249847Y1415908D01*
X2248607Y1412914D01*
X2248184Y1409700D01*
X2248607Y1406487D01*
X2249847Y1403492D01*
X2251820Y1400921D01*
X2254392Y1398947D01*
X2255043Y1398678D01*
Y1395323D01*
X2254392Y1395053D01*
X2251820Y1393080D01*
X2249847Y1390508D01*
X2248607Y1387514D01*
X2248184Y1384300D01*
X2248607Y1381087D01*
X2249847Y1378092D01*
X2251820Y1375521D01*
X2254392Y1373547D01*
X2255043Y1373278D01*
Y1369922D01*
X2254392Y1369653D01*
X2251820Y1367680D01*
X2249847Y1365108D01*
X2248607Y1362114D01*
X2248184Y1358900D01*
X2248607Y1355687D01*
X2249847Y1352692D01*
X2251820Y1350121D01*
X2254392Y1348147D01*
X2255043Y1347878D01*
Y1344523D01*
X2254392Y1344253D01*
X2251820Y1342280D01*
X2249847Y1339708D01*
X2248607Y1336714D01*
X2248184Y1333500D01*
X2248607Y1330287D01*
X2249847Y1327292D01*
X2251820Y1324721D01*
X2254392Y1322747D01*
X2255043Y1322478D01*
Y1319122D01*
X2254392Y1318853D01*
X2251820Y1316880D01*
X2249847Y1314308D01*
X2248607Y1311314D01*
X2248184Y1308100D01*
X2248607Y1304887D01*
X2249847Y1301892D01*
X2251820Y1299321D01*
X2254392Y1297347D01*
X2255043Y1297078D01*
Y1293723D01*
X2254392Y1293453D01*
X2251820Y1291480D01*
X2249847Y1288908D01*
X2248607Y1285914D01*
X2248184Y1282700D01*
X2248607Y1279487D01*
X2249847Y1276492D01*
X2251820Y1273921D01*
X2254392Y1271947D01*
X2255043Y1271678D01*
Y1268323D01*
X2254392Y1268053D01*
X2251820Y1266080D01*
X2249847Y1263508D01*
X2248607Y1260514D01*
X2248184Y1257300D01*
X2248607Y1254087D01*
X2249847Y1251092D01*
X2251820Y1248521D01*
X2254392Y1246547D01*
X2255043Y1246278D01*
Y1242923D01*
X2254392Y1242653D01*
X2251820Y1240680D01*
X2249847Y1238108D01*
X2248607Y1235114D01*
X2248184Y1231900D01*
X2248607Y1228687D01*
X2249847Y1225692D01*
X2251820Y1223121D01*
X2254392Y1221147D01*
X2255043Y1220878D01*
Y1217523D01*
X2254392Y1217253D01*
X2251820Y1215280D01*
X2249847Y1212708D01*
X2248607Y1209714D01*
X2248184Y1206500D01*
X2248607Y1203287D01*
X2249847Y1200292D01*
X2251820Y1197721D01*
X2254392Y1195747D01*
X2255043Y1195478D01*
Y1192122D01*
X2254392Y1191853D01*
X2251820Y1189880D01*
X2249847Y1187308D01*
X2248607Y1184314D01*
X2248184Y1181100D01*
X2248607Y1177887D01*
X2249847Y1174892D01*
X2251820Y1172321D01*
X2254392Y1170347D01*
X2255043Y1170078D01*
Y1166722D01*
X2254392Y1166453D01*
X2251820Y1164480D01*
X2249847Y1161908D01*
X2248607Y1158914D01*
X2248184Y1155700D01*
X2248607Y1152487D01*
X2249847Y1149492D01*
X2251820Y1146921D01*
X2254392Y1144947D01*
X2255043Y1144678D01*
Y1141322D01*
X2254392Y1141053D01*
X2251820Y1139080D01*
X2249847Y1136508D01*
X2248607Y1133514D01*
X2248184Y1130300D01*
X2248607Y1127087D01*
X2249847Y1124092D01*
X2251820Y1121521D01*
X2254392Y1119547D01*
X2255043Y1119278D01*
Y1115922D01*
X2254392Y1115653D01*
X2251820Y1113680D01*
X2249847Y1111108D01*
X2248607Y1108114D01*
X2248184Y1104900D01*
X2248607Y1101687D01*
X2249847Y1098692D01*
X2251820Y1096121D01*
X2254392Y1094147D01*
X2255043Y1093878D01*
Y1090523D01*
X2254392Y1090253D01*
X2251820Y1088280D01*
X2249847Y1085708D01*
X2248607Y1082714D01*
X2248184Y1079500D01*
X2248607Y1076287D01*
X2249847Y1073292D01*
X2251820Y1070721D01*
X2254392Y1068747D01*
X2255043Y1068478D01*
Y1065123D01*
X2254392Y1064853D01*
X2251820Y1062880D01*
X2249847Y1060308D01*
X2248607Y1057314D01*
X2248184Y1054100D01*
X2248607Y1050887D01*
X2249847Y1047892D01*
X2251820Y1045321D01*
X2254392Y1043347D01*
X2255043Y1043078D01*
Y1039723D01*
X2254392Y1039453D01*
X2251820Y1037480D01*
X2249847Y1034908D01*
X2248607Y1031914D01*
X2248184Y1028700D01*
X2248607Y1025487D01*
X2249847Y1022492D01*
X2251820Y1019921D01*
X2254392Y1017947D01*
X2255043Y1017678D01*
Y1014323D01*
X2254392Y1014053D01*
X2251820Y1012080D01*
X2249847Y1009508D01*
X2248607Y1006514D01*
X2248184Y1003300D01*
X2248607Y1000087D01*
X2249847Y997092D01*
X2251820Y994521D01*
X2254392Y992547D01*
X2255043Y992278D01*
Y988923D01*
X2254392Y988653D01*
X2251820Y986680D01*
X2249847Y984108D01*
X2248607Y981114D01*
X2248184Y977900D01*
X2248607Y974687D01*
X2249847Y971692D01*
X2251820Y969121D01*
X2254392Y967147D01*
X2255043Y966878D01*
Y963522D01*
X2254392Y963253D01*
X2251820Y961280D01*
X2249847Y958708D01*
X2248607Y955714D01*
X2248184Y952500D01*
X2248607Y949287D01*
X2249847Y946292D01*
X2251820Y943721D01*
X2253536Y942404D01*
X2253883Y939469D01*
X2253706Y938676D01*
X2252263Y937348D01*
X2153828D01*
X2151182Y939379D01*
X2147822Y940770D01*
X2144217Y941245D01*
X2140612Y940770D01*
X2137253Y939379D01*
X2134368Y937165D01*
X2132154Y934280D01*
X2130763Y930921D01*
X2130288Y927316D01*
X2130763Y923710D01*
X2132154Y920351D01*
X2134368Y917466D01*
X2137253Y915253D01*
X2140612Y913861D01*
X2144217Y913386D01*
X2147822Y913861D01*
X2151182Y915253D01*
X2153267Y916852D01*
X2253734D01*
X2254392Y916347D01*
X2255043Y916078D01*
Y912722D01*
X2254392Y912453D01*
X2251820Y910480D01*
X2249847Y907908D01*
X2248607Y904914D01*
X2248184Y901700D01*
X2248607Y898487D01*
X2249847Y895492D01*
X2251820Y892921D01*
X2254392Y890947D01*
X2257386Y889707D01*
X2260600Y889284D01*
X2263813Y889707D01*
X2266808Y890947D01*
X2269379Y892921D01*
X2271353Y895492D01*
X2272593Y898487D01*
X2273016Y901700D01*
X2272593Y904914D01*
X2271353Y907908D01*
X2269379Y910480D01*
X2267664Y911796D01*
X2267317Y914732D01*
X2267493Y915525D01*
X2268936Y916852D01*
X2304534D01*
X2305192Y916347D01*
X2305842Y916078D01*
Y912722D01*
X2305192Y912453D01*
X2302620Y910480D01*
X2300647Y907908D01*
X2299407Y904914D01*
X2298984Y901700D01*
X2299407Y898487D01*
X2300647Y895492D01*
X2302620Y892921D01*
X2305192Y890947D01*
X2308186Y889707D01*
X2311400Y889284D01*
X2314613Y889707D01*
X2317608Y890947D01*
X2320179Y892921D01*
X2322153Y895492D01*
X2323393Y898487D01*
X2323816Y901700D01*
X2323393Y904914D01*
X2322153Y907908D01*
X2320179Y910480D01*
X2317608Y912453D01*
X2316957Y912722D01*
Y916078D01*
X2317608Y916347D01*
X2320179Y918321D01*
X2322153Y920892D01*
X2323393Y923887D01*
X2323816Y927100D01*
X2323393Y930314D01*
X2322153Y933308D01*
X2320179Y935880D01*
X2317608Y937853D01*
X2316957Y938122D01*
Y941478D01*
X2317608Y941747D01*
X2320179Y943721D01*
X2322153Y946292D01*
X2323393Y949287D01*
X2323816Y952500D01*
X2323393Y955714D01*
X2322153Y958708D01*
X2320179Y961280D01*
X2317608Y963253D01*
X2316957Y963522D01*
Y966878D01*
X2317608Y967147D01*
X2320179Y969121D01*
X2322153Y971692D01*
X2323393Y974687D01*
X2323816Y977900D01*
X2323393Y981114D01*
X2322153Y984108D01*
X2320179Y986680D01*
X2317608Y988653D01*
X2316957Y988923D01*
Y992278D01*
X2317608Y992547D01*
X2320179Y994521D01*
X2322153Y997092D01*
X2323393Y1000087D01*
X2323816Y1003300D01*
X2323393Y1006514D01*
X2322153Y1009508D01*
X2320179Y1012080D01*
X2317608Y1014053D01*
X2316957Y1014323D01*
Y1017678D01*
X2317608Y1017947D01*
X2320179Y1019921D01*
X2322153Y1022492D01*
X2323393Y1025487D01*
X2323816Y1028700D01*
X2323393Y1031914D01*
X2322153Y1034908D01*
X2320179Y1037480D01*
X2317608Y1039453D01*
X2316957Y1039723D01*
Y1043078D01*
X2317608Y1043347D01*
X2320179Y1045321D01*
X2322153Y1047892D01*
X2323393Y1050887D01*
X2323816Y1054100D01*
X2323393Y1057314D01*
X2322153Y1060308D01*
X2320179Y1062880D01*
X2317608Y1064853D01*
X2316957Y1065123D01*
Y1068478D01*
X2317608Y1068747D01*
X2320179Y1070721D01*
X2322153Y1073292D01*
X2323393Y1076287D01*
X2323816Y1079500D01*
X2323393Y1082714D01*
X2322153Y1085708D01*
X2320179Y1088280D01*
X2317608Y1090253D01*
X2316957Y1090523D01*
Y1093878D01*
X2317608Y1094147D01*
X2320179Y1096121D01*
X2322153Y1098692D01*
X2323393Y1101687D01*
X2323816Y1104900D01*
X2323393Y1108114D01*
X2322153Y1111108D01*
X2320179Y1113680D01*
X2317608Y1115653D01*
X2316957Y1115922D01*
Y1119278D01*
X2317608Y1119547D01*
X2320179Y1121521D01*
X2322153Y1124092D01*
X2323393Y1127087D01*
X2323816Y1130300D01*
X2323393Y1133514D01*
X2322153Y1136508D01*
X2320179Y1139080D01*
X2317608Y1141053D01*
X2316957Y1141322D01*
Y1144678D01*
X2317608Y1144947D01*
X2320179Y1146921D01*
X2322153Y1149492D01*
X2323393Y1152487D01*
X2323816Y1155700D01*
X2323393Y1158914D01*
X2322153Y1161908D01*
X2320179Y1164480D01*
X2317608Y1166453D01*
X2316957Y1166722D01*
Y1170078D01*
X2317608Y1170347D01*
X2320179Y1172321D01*
X2322153Y1174892D01*
X2323393Y1177887D01*
X2323816Y1181100D01*
X2323393Y1184314D01*
X2322153Y1187308D01*
X2320179Y1189880D01*
X2317608Y1191853D01*
X2316957Y1192122D01*
Y1195478D01*
X2317608Y1195747D01*
X2320179Y1197721D01*
X2322153Y1200292D01*
X2323393Y1203287D01*
X2323816Y1206500D01*
X2323393Y1209714D01*
X2322153Y1212708D01*
X2320179Y1215280D01*
X2317608Y1217253D01*
X2316957Y1217523D01*
Y1220878D01*
X2317608Y1221147D01*
X2320179Y1223121D01*
X2322153Y1225692D01*
X2323393Y1228687D01*
X2323816Y1231900D01*
X2323393Y1235114D01*
X2322153Y1238108D01*
X2320179Y1240680D01*
X2317608Y1242653D01*
X2316957Y1242923D01*
Y1246278D01*
X2317608Y1246547D01*
X2320179Y1248521D01*
X2322153Y1251092D01*
X2323393Y1254087D01*
X2323816Y1257300D01*
X2323393Y1260514D01*
X2322153Y1263508D01*
X2320179Y1266080D01*
X2317608Y1268053D01*
X2316957Y1268323D01*
Y1271678D01*
X2317608Y1271947D01*
X2320179Y1273921D01*
X2322153Y1276492D01*
X2323393Y1279487D01*
X2323816Y1282700D01*
X2323393Y1285914D01*
X2322153Y1288908D01*
X2320179Y1291480D01*
X2317608Y1293453D01*
X2316957Y1293723D01*
Y1297078D01*
X2317608Y1297347D01*
X2320179Y1299321D01*
X2322153Y1301892D01*
X2323393Y1304887D01*
X2323816Y1308100D01*
X2323393Y1311314D01*
X2322153Y1314308D01*
X2320179Y1316880D01*
X2317608Y1318853D01*
X2316957Y1319122D01*
Y1322478D01*
X2317608Y1322747D01*
X2320179Y1324721D01*
X2322153Y1327292D01*
X2323393Y1330287D01*
X2323816Y1333500D01*
X2323393Y1336714D01*
X2322153Y1339708D01*
X2320179Y1342280D01*
X2317608Y1344253D01*
X2316957Y1344523D01*
Y1347878D01*
X2317608Y1348147D01*
X2320179Y1350121D01*
X2322153Y1352692D01*
X2323393Y1355687D01*
X2323816Y1358900D01*
X2323393Y1362114D01*
X2322153Y1365108D01*
X2320179Y1367680D01*
X2317608Y1369653D01*
X2316957Y1369922D01*
Y1373278D01*
X2317608Y1373547D01*
X2320179Y1375521D01*
X2322153Y1378092D01*
X2323393Y1381087D01*
X2323816Y1384300D01*
X2323393Y1387514D01*
X2322153Y1390508D01*
X2320179Y1393080D01*
X2317608Y1395053D01*
X2316957Y1395323D01*
Y1398678D01*
X2317608Y1398947D01*
X2320179Y1400921D01*
X2322153Y1403492D01*
X2323393Y1406487D01*
X2323816Y1409700D01*
X2323393Y1412914D01*
X2322153Y1415908D01*
X2320179Y1418480D01*
X2317608Y1420453D01*
X2316957Y1420723D01*
Y1424078D01*
X2317608Y1424347D01*
X2320179Y1426321D01*
X2322153Y1428892D01*
X2323393Y1431887D01*
X2323816Y1435100D01*
X2323393Y1438314D01*
X2322153Y1441308D01*
X2320179Y1443880D01*
X2317608Y1445853D01*
X2316957Y1446122D01*
Y1449478D01*
X2317608Y1449747D01*
X2320179Y1451721D01*
X2322153Y1454292D01*
X2323393Y1457287D01*
X2323816Y1460500D01*
X2323393Y1463714D01*
X2322153Y1466708D01*
X2320179Y1469280D01*
X2317608Y1471253D01*
X2316957Y1471523D01*
Y1474878D01*
X2317608Y1475147D01*
X2320179Y1477121D01*
X2322153Y1479692D01*
X2323393Y1482687D01*
X2323816Y1485900D01*
X2323393Y1489114D01*
X2322153Y1492108D01*
X2320179Y1494680D01*
X2317608Y1496653D01*
X2316957Y1496922D01*
Y1500278D01*
X2317608Y1500547D01*
X2320179Y1502521D01*
X2322153Y1505092D01*
X2323393Y1508087D01*
X2323816Y1511300D01*
X2323393Y1514514D01*
X2322153Y1517508D01*
X2320179Y1520080D01*
X2317608Y1522053D01*
X2316957Y1522323D01*
Y1525678D01*
X2317608Y1525947D01*
X2320179Y1527921D01*
X2322153Y1530492D01*
X2323393Y1533487D01*
X2323816Y1536700D01*
X2323393Y1539914D01*
X2322153Y1542908D01*
X2320179Y1545480D01*
X2317608Y1547453D01*
X2316957Y1547722D01*
Y1551078D01*
X2317608Y1551347D01*
X2320179Y1553321D01*
X2322153Y1555892D01*
X2323393Y1558887D01*
X2323816Y1562100D01*
X2323393Y1565314D01*
X2322153Y1568308D01*
X2320179Y1570880D01*
X2317608Y1572853D01*
X2316957Y1573123D01*
Y1576478D01*
X2317608Y1576747D01*
X2320179Y1578721D01*
X2322153Y1581292D01*
X2323393Y1584287D01*
X2323816Y1587500D01*
X2323393Y1590714D01*
X2322153Y1593708D01*
X2320179Y1596280D01*
X2317608Y1598253D01*
X2316957Y1598522D01*
Y1601878D01*
X2317608Y1602147D01*
X2320179Y1604121D01*
X2322153Y1606692D01*
X2323393Y1609687D01*
X2323816Y1612900D01*
X2323393Y1616114D01*
X2322153Y1619108D01*
X2320179Y1621680D01*
X2317608Y1623653D01*
X2316957Y1623922D01*
Y1627278D01*
X2317608Y1627547D01*
X2320179Y1629521D01*
X2322153Y1632092D01*
X2323393Y1635087D01*
X2323816Y1638300D01*
X2323393Y1641514D01*
X2322153Y1644508D01*
X2320179Y1647080D01*
X2317608Y1649053D01*
X2316957Y1649323D01*
Y1652678D01*
X2317608Y1652947D01*
X2320179Y1654921D01*
X2322153Y1657492D01*
X2323393Y1660487D01*
X2323816Y1663700D01*
X2323393Y1666914D01*
X2322153Y1669908D01*
X2320179Y1672480D01*
X2317608Y1674453D01*
X2314613Y1675693D01*
X2311400Y1676116D01*
D02*
G37*
G36*
X1511300Y1716252D02*
X1508217Y1715846D01*
X1505344Y1714656D01*
X1502877Y1712763D01*
X1501722Y1711257D01*
X1460500D01*
X1458710Y1711022D01*
X1457041Y1710331D01*
X1455609Y1709231D01*
X1379409Y1633031D01*
X1378309Y1631599D01*
X1377619Y1629930D01*
X1377383Y1628140D01*
Y1399865D01*
X1298129Y1320611D01*
X1297030Y1319179D01*
X1296339Y1317510D01*
X1296103Y1315720D01*
Y1302438D01*
X1294597Y1301283D01*
X1292704Y1298816D01*
X1291514Y1295943D01*
X1291108Y1292860D01*
X1291514Y1289777D01*
X1292704Y1286904D01*
X1294597Y1284437D01*
X1297064Y1282544D01*
X1299937Y1281354D01*
X1303020Y1280948D01*
X1306103Y1281354D01*
X1308976Y1282544D01*
X1311443Y1284437D01*
X1313336Y1286904D01*
X1314050Y1288628D01*
X1317390D01*
X1318104Y1286904D01*
X1319997Y1284437D01*
X1322464Y1282544D01*
X1325337Y1281354D01*
X1328420Y1280948D01*
X1331503Y1281354D01*
X1334376Y1282544D01*
X1336843Y1284437D01*
X1338736Y1286904D01*
X1339926Y1289777D01*
X1340332Y1292860D01*
X1339926Y1295943D01*
X1338736Y1298816D01*
X1336843Y1301283D01*
X1335337Y1302438D01*
Y1317935D01*
X1447986Y1430583D01*
X1450321Y1428535D01*
X1450184Y1428356D01*
X1448994Y1425483D01*
X1448588Y1422400D01*
X1448994Y1419317D01*
X1450184Y1416444D01*
X1452077Y1413977D01*
X1454544Y1412084D01*
X1457417Y1410894D01*
X1460500Y1410488D01*
X1463583Y1410894D01*
X1466456Y1412084D01*
X1468923Y1413977D01*
X1470816Y1416444D01*
X1471530Y1418168D01*
X1474870D01*
X1475584Y1416444D01*
X1477477Y1413977D01*
X1479944Y1412084D01*
X1482817Y1410894D01*
X1485900Y1410488D01*
X1488983Y1410894D01*
X1491856Y1412084D01*
X1494323Y1413977D01*
X1496216Y1416444D01*
X1496930Y1418168D01*
X1500270D01*
X1500984Y1416444D01*
X1502877Y1413977D01*
X1505344Y1412084D01*
X1508217Y1410894D01*
X1511300Y1410488D01*
X1514383Y1410894D01*
X1517256Y1412084D01*
X1519723Y1413977D01*
X1521616Y1416444D01*
X1522806Y1419317D01*
X1523212Y1422400D01*
X1522806Y1425483D01*
X1521616Y1428356D01*
X1519723Y1430823D01*
X1518217Y1431978D01*
Y1450922D01*
X1519723Y1452077D01*
X1521616Y1454544D01*
X1522806Y1457417D01*
X1523212Y1460500D01*
X1522806Y1463583D01*
X1521616Y1466456D01*
X1519723Y1468923D01*
X1517256Y1470816D01*
X1514383Y1472006D01*
X1511300Y1472412D01*
X1508217Y1472006D01*
X1505344Y1470816D01*
X1502877Y1468923D01*
X1501722Y1467417D01*
X1468120D01*
X1466330Y1467182D01*
X1464661Y1466490D01*
X1463229Y1465391D01*
X1394269Y1396431D01*
X1393042Y1396660D01*
X1391217Y1397764D01*
Y1625275D01*
X1463365Y1697423D01*
X1501722D01*
X1502877Y1695917D01*
X1504383Y1694762D01*
Y1675818D01*
X1502877Y1674663D01*
X1500984Y1672196D01*
X1500270Y1670472D01*
X1496930D01*
X1496216Y1672196D01*
X1494323Y1674663D01*
X1491856Y1676556D01*
X1488983Y1677746D01*
X1485900Y1678152D01*
X1482817Y1677746D01*
X1479944Y1676556D01*
X1477477Y1674663D01*
X1475584Y1672196D01*
X1474870Y1670472D01*
X1471530D01*
X1470816Y1672196D01*
X1468923Y1674663D01*
X1466456Y1676556D01*
X1463583Y1677746D01*
X1460500Y1678152D01*
X1457417Y1677746D01*
X1454544Y1676556D01*
X1452077Y1674663D01*
X1450184Y1672196D01*
X1448994Y1669323D01*
X1448588Y1666240D01*
X1448994Y1663157D01*
X1450184Y1660284D01*
X1452077Y1657817D01*
X1454544Y1655924D01*
X1457417Y1654734D01*
X1460500Y1654328D01*
X1463583Y1654734D01*
X1466456Y1655924D01*
X1468923Y1657817D01*
X1470816Y1660284D01*
X1471530Y1662008D01*
X1474870D01*
X1475584Y1660284D01*
X1477477Y1657817D01*
X1479944Y1655924D01*
X1482817Y1654734D01*
X1485900Y1654328D01*
X1488983Y1654734D01*
X1491856Y1655924D01*
X1494323Y1657817D01*
X1496216Y1660284D01*
X1496930Y1662008D01*
X1500270D01*
X1500984Y1660284D01*
X1502877Y1657817D01*
X1505344Y1655924D01*
X1508217Y1654734D01*
X1511300Y1654328D01*
X1514383Y1654734D01*
X1517256Y1655924D01*
X1519723Y1657817D01*
X1521616Y1660284D01*
X1522806Y1663157D01*
X1523212Y1666240D01*
X1522806Y1669323D01*
X1521616Y1672196D01*
X1519723Y1674663D01*
X1518217Y1675818D01*
Y1694762D01*
X1519723Y1695917D01*
X1521616Y1698384D01*
X1522806Y1701257D01*
X1523212Y1704340D01*
X1522806Y1707423D01*
X1521616Y1710296D01*
X1519723Y1712763D01*
X1517256Y1714656D01*
X1514383Y1715846D01*
X1511300Y1716252D01*
D02*
G37*
G36*
X1701800Y1677648D02*
X1698848Y1677259D01*
X1696096Y1676119D01*
X1693734Y1674306D01*
X1691921Y1671944D01*
X1690781Y1669193D01*
X1690392Y1666240D01*
X1690781Y1663288D01*
X1691921Y1660536D01*
X1693734Y1658174D01*
X1696096Y1656361D01*
X1698848Y1655221D01*
X1701800Y1654832D01*
X1704753Y1655221D01*
X1707504Y1656361D01*
X1709866Y1658174D01*
X1711679Y1660536D01*
X1712819Y1663288D01*
X1713208Y1666240D01*
X1712819Y1669193D01*
X1711679Y1671944D01*
X1709866Y1674306D01*
X1707504Y1676119D01*
X1704753Y1677259D01*
X1701800Y1677648D01*
D02*
G37*
G36*
X1600200D02*
X1597247Y1677259D01*
X1594496Y1676119D01*
X1592134Y1674306D01*
X1590321Y1671944D01*
X1589181Y1669193D01*
X1588792Y1666240D01*
X1589181Y1663288D01*
X1590321Y1660536D01*
X1592134Y1658174D01*
X1594496Y1656361D01*
X1597247Y1655221D01*
X1600200Y1654832D01*
X1603152Y1655221D01*
X1605904Y1656361D01*
X1608266Y1658174D01*
X1610079Y1660536D01*
X1611219Y1663288D01*
X1611608Y1666240D01*
X1611219Y1669193D01*
X1610079Y1671944D01*
X1608266Y1674306D01*
X1605904Y1676119D01*
X1603152Y1677259D01*
X1600200Y1677648D01*
D02*
G37*
G36*
X1701800Y1626848D02*
X1698848Y1626459D01*
X1696096Y1625319D01*
X1693734Y1623506D01*
X1691921Y1621144D01*
X1690781Y1618392D01*
X1690392Y1615440D01*
X1690781Y1612487D01*
X1691921Y1609736D01*
X1693734Y1607374D01*
X1696096Y1605561D01*
X1698848Y1604421D01*
X1701800Y1604032D01*
X1704753Y1604421D01*
X1707504Y1605561D01*
X1709866Y1607374D01*
X1711679Y1609736D01*
X1712819Y1612487D01*
X1713208Y1615440D01*
X1712819Y1618392D01*
X1711679Y1621144D01*
X1709866Y1623506D01*
X1707504Y1625319D01*
X1704753Y1626459D01*
X1701800Y1626848D01*
D02*
G37*
G36*
X1600200D02*
X1597247Y1626459D01*
X1594496Y1625319D01*
X1592134Y1623506D01*
X1590321Y1621144D01*
X1589181Y1618392D01*
X1588792Y1615440D01*
X1589181Y1612487D01*
X1590321Y1609736D01*
X1592134Y1607374D01*
X1594496Y1605561D01*
X1597247Y1604421D01*
X1600200Y1604032D01*
X1603152Y1604421D01*
X1605904Y1605561D01*
X1608266Y1607374D01*
X1610079Y1609736D01*
X1611219Y1612487D01*
X1611608Y1615440D01*
X1611219Y1618392D01*
X1610079Y1621144D01*
X1608266Y1623506D01*
X1605904Y1625319D01*
X1603152Y1626459D01*
X1600200Y1626848D01*
D02*
G37*
G36*
X1549400Y1716252D02*
X1546317Y1715846D01*
X1543444Y1714656D01*
X1540977Y1712763D01*
X1539084Y1710296D01*
X1537894Y1707423D01*
X1537488Y1704340D01*
X1537894Y1701257D01*
X1539084Y1698384D01*
X1540977Y1695917D01*
X1542483Y1694762D01*
Y1656405D01*
X1487782Y1601704D01*
X1485900Y1601952D01*
X1482817Y1601546D01*
X1479944Y1600356D01*
X1477477Y1598463D01*
X1475584Y1595996D01*
X1475410Y1595576D01*
X1472310Y1596192D01*
Y1601850D01*
X1448690D01*
Y1578230D01*
X1453583D01*
Y1561518D01*
X1452077Y1560363D01*
X1450184Y1557896D01*
X1448994Y1555023D01*
X1448588Y1551940D01*
X1448994Y1548857D01*
X1450184Y1545984D01*
X1452077Y1543517D01*
X1454544Y1541624D01*
X1457417Y1540434D01*
X1460500Y1540028D01*
X1463583Y1540434D01*
X1466456Y1541624D01*
X1468923Y1543517D01*
X1470816Y1545984D01*
X1472006Y1548857D01*
X1472412Y1551940D01*
X1472006Y1555023D01*
X1470816Y1557896D01*
X1468923Y1560363D01*
X1467417Y1561518D01*
Y1578230D01*
X1472310D01*
Y1583887D01*
X1475410Y1584504D01*
X1475584Y1584084D01*
X1477477Y1581617D01*
X1479944Y1579724D01*
X1482817Y1578534D01*
X1485900Y1578128D01*
X1488983Y1578534D01*
X1491856Y1579724D01*
X1494323Y1581617D01*
X1496216Y1584084D01*
X1496930Y1585808D01*
X1500270D01*
X1500984Y1584084D01*
X1502877Y1581617D01*
X1505344Y1579724D01*
X1508217Y1578534D01*
X1511300Y1578128D01*
X1514383Y1578534D01*
X1517256Y1579724D01*
X1519723Y1581617D01*
X1521616Y1584084D01*
X1522806Y1586957D01*
X1523212Y1590040D01*
X1522806Y1593123D01*
X1521616Y1595996D01*
X1519723Y1598463D01*
X1517256Y1600356D01*
X1514383Y1601546D01*
X1511899Y1601873D01*
X1510964Y1603483D01*
X1510633Y1604991D01*
X1554291Y1648649D01*
X1555390Y1650081D01*
X1556082Y1651750D01*
X1556317Y1653540D01*
Y1694762D01*
X1557823Y1695917D01*
X1559716Y1698384D01*
X1560906Y1701257D01*
X1561312Y1704340D01*
X1560906Y1707423D01*
X1559716Y1710296D01*
X1557823Y1712763D01*
X1555356Y1714656D01*
X1552483Y1715846D01*
X1549400Y1716252D01*
D02*
G37*
G36*
X1651000Y1472412D02*
X1647917Y1472006D01*
X1645044Y1470816D01*
X1642577Y1468923D01*
X1640684Y1466456D01*
X1639494Y1463583D01*
X1639088Y1460500D01*
X1639494Y1457417D01*
X1640684Y1454544D01*
X1642577Y1452077D01*
X1644083Y1450922D01*
Y1431348D01*
X1642934Y1430466D01*
X1641121Y1428104D01*
X1639981Y1425352D01*
X1639592Y1422400D01*
X1639981Y1419447D01*
X1641121Y1416696D01*
X1642934Y1414334D01*
X1645296Y1412521D01*
X1648047Y1411381D01*
X1651000Y1410992D01*
X1653952Y1411381D01*
X1656704Y1412521D01*
X1659066Y1414334D01*
X1660879Y1416696D01*
X1662019Y1419447D01*
X1662408Y1422400D01*
X1662019Y1425352D01*
X1660879Y1428104D01*
X1659066Y1430466D01*
X1657917Y1431348D01*
Y1450922D01*
X1659423Y1452077D01*
X1660578Y1453583D01*
X1724335D01*
X1726899Y1451019D01*
X1726475Y1447800D01*
X1726933Y1444325D01*
X1728274Y1441088D01*
X1730407Y1438307D01*
X1733188Y1436174D01*
X1736425Y1434833D01*
X1739900Y1434375D01*
X1743375Y1434833D01*
X1746612Y1436174D01*
X1749393Y1438307D01*
X1751526Y1441088D01*
X1752867Y1444325D01*
X1753325Y1447800D01*
X1752867Y1451275D01*
X1751526Y1454512D01*
X1749393Y1457293D01*
X1746612Y1459426D01*
X1743375Y1460767D01*
X1739900Y1461225D01*
X1736681Y1460801D01*
X1732091Y1465391D01*
X1730659Y1466490D01*
X1728990Y1467182D01*
X1727200Y1467417D01*
X1660578D01*
X1659423Y1468923D01*
X1656956Y1470816D01*
X1654083Y1472006D01*
X1651000Y1472412D01*
D02*
G37*
G36*
X1701800Y1433808D02*
X1698848Y1433419D01*
X1696096Y1432279D01*
X1693734Y1430466D01*
X1691921Y1428104D01*
X1690781Y1425352D01*
X1690392Y1422400D01*
X1690781Y1419447D01*
X1691921Y1416696D01*
X1693734Y1414334D01*
X1696096Y1412521D01*
X1698848Y1411381D01*
X1701800Y1410992D01*
X1704753Y1411381D01*
X1707504Y1412521D01*
X1709866Y1414334D01*
X1711679Y1416696D01*
X1712819Y1419447D01*
X1713208Y1422400D01*
X1712819Y1425352D01*
X1711679Y1428104D01*
X1709866Y1430466D01*
X1707504Y1432279D01*
X1704753Y1433419D01*
X1701800Y1433808D01*
D02*
G37*
G36*
X1600200D02*
X1597247Y1433419D01*
X1594496Y1432279D01*
X1592134Y1430466D01*
X1590321Y1428104D01*
X1589181Y1425352D01*
X1588792Y1422400D01*
X1589181Y1419447D01*
X1590321Y1416696D01*
X1592134Y1414334D01*
X1594496Y1412521D01*
X1597247Y1411381D01*
X1600200Y1410992D01*
X1603152Y1411381D01*
X1605904Y1412521D01*
X1608266Y1414334D01*
X1610079Y1416696D01*
X1611219Y1419447D01*
X1611608Y1422400D01*
X1611219Y1425352D01*
X1610079Y1428104D01*
X1608266Y1430466D01*
X1605904Y1432279D01*
X1603152Y1433419D01*
X1600200Y1433808D01*
D02*
G37*
G36*
X853900Y1515475D02*
X850425Y1515017D01*
X847188Y1513676D01*
X844407Y1511543D01*
X842274Y1508762D01*
X840933Y1505525D01*
X840475Y1502050D01*
X840933Y1498575D01*
X842274Y1495338D01*
X844407Y1492557D01*
X847188Y1490424D01*
X848506Y1489878D01*
Y1486522D01*
X847188Y1485976D01*
X844407Y1483843D01*
X842274Y1481062D01*
X840933Y1477825D01*
X840475Y1474350D01*
X840933Y1470875D01*
X842274Y1467638D01*
X844407Y1464857D01*
X847188Y1462724D01*
X848506Y1462178D01*
Y1458822D01*
X847188Y1458276D01*
X844407Y1456143D01*
X842274Y1453362D01*
X840933Y1450125D01*
X840475Y1446650D01*
X840933Y1443175D01*
X842274Y1439938D01*
X844407Y1437157D01*
X847188Y1435024D01*
X848506Y1434478D01*
Y1431122D01*
X847188Y1430576D01*
X844407Y1428443D01*
X842274Y1425662D01*
X840933Y1422425D01*
X840475Y1418950D01*
X840933Y1415475D01*
X842274Y1412238D01*
X844407Y1409457D01*
X847188Y1407324D01*
X848506Y1406778D01*
Y1403422D01*
X847188Y1402876D01*
X844407Y1400743D01*
X842274Y1397962D01*
X840933Y1394724D01*
X840475Y1391250D01*
X840933Y1387775D01*
X842274Y1384538D01*
X844407Y1381757D01*
X847188Y1379624D01*
X850425Y1378282D01*
X853900Y1377825D01*
X857375Y1378282D01*
X860612Y1379624D01*
X863393Y1381757D01*
X865526Y1384538D01*
X866867Y1387775D01*
X867325Y1391250D01*
X866867Y1394724D01*
X865526Y1397962D01*
X863393Y1400743D01*
X860612Y1402876D01*
X859294Y1403422D01*
Y1406778D01*
X860612Y1407324D01*
X863393Y1409457D01*
X865526Y1412238D01*
X866867Y1415475D01*
X867325Y1418950D01*
X866867Y1422425D01*
X865526Y1425662D01*
X863393Y1428443D01*
X860612Y1430576D01*
X859294Y1431122D01*
Y1434478D01*
X860612Y1435024D01*
X863393Y1437157D01*
X865526Y1439938D01*
X866867Y1443175D01*
X867325Y1446650D01*
X866867Y1450125D01*
X865526Y1453362D01*
X863393Y1456143D01*
X860612Y1458276D01*
X859294Y1458822D01*
Y1462178D01*
X860612Y1462724D01*
X863393Y1464857D01*
X865526Y1467638D01*
X866867Y1470875D01*
X867325Y1474350D01*
X866867Y1477825D01*
X865526Y1481062D01*
X863393Y1483843D01*
X860612Y1485976D01*
X859294Y1486522D01*
Y1489878D01*
X860612Y1490424D01*
X863393Y1492557D01*
X865526Y1495338D01*
X866867Y1498575D01*
X867325Y1502050D01*
X866867Y1505525D01*
X865526Y1508762D01*
X863393Y1511543D01*
X860612Y1513676D01*
X857375Y1515017D01*
X853900Y1515475D01*
D02*
G37*
G36*
X1701800Y1383008D02*
X1698848Y1382619D01*
X1696096Y1381479D01*
X1693734Y1379666D01*
X1691921Y1377304D01*
X1690781Y1374552D01*
X1690392Y1371600D01*
X1690781Y1368647D01*
X1691921Y1365896D01*
X1693734Y1363534D01*
X1696096Y1361721D01*
X1698848Y1360581D01*
X1701800Y1360192D01*
X1704753Y1360581D01*
X1707504Y1361721D01*
X1709866Y1363534D01*
X1711679Y1365896D01*
X1712819Y1368647D01*
X1713208Y1371600D01*
X1712819Y1374552D01*
X1711679Y1377304D01*
X1709866Y1379666D01*
X1707504Y1381479D01*
X1704753Y1382619D01*
X1701800Y1383008D01*
D02*
G37*
G36*
X1600200D02*
X1597247Y1382619D01*
X1594496Y1381479D01*
X1592134Y1379666D01*
X1590321Y1377304D01*
X1589181Y1374552D01*
X1588792Y1371600D01*
X1589181Y1368647D01*
X1590321Y1365896D01*
X1592134Y1363534D01*
X1594496Y1361721D01*
X1597247Y1360581D01*
X1600200Y1360192D01*
X1603152Y1360581D01*
X1605904Y1361721D01*
X1608266Y1363534D01*
X1610079Y1365896D01*
X1611219Y1368647D01*
X1611608Y1371600D01*
X1611219Y1374552D01*
X1610079Y1377304D01*
X1608266Y1379666D01*
X1605904Y1381479D01*
X1603152Y1382619D01*
X1600200Y1383008D01*
D02*
G37*
G36*
X1549400Y1472412D02*
X1546317Y1472006D01*
X1543444Y1470816D01*
X1540977Y1468923D01*
X1539084Y1466456D01*
X1537894Y1463583D01*
X1537488Y1460500D01*
X1537894Y1457417D01*
X1539084Y1454544D01*
X1540977Y1452077D01*
X1542483Y1450922D01*
Y1412565D01*
X1487782Y1357864D01*
X1485900Y1358112D01*
X1482817Y1357706D01*
X1479944Y1356516D01*
X1477477Y1354623D01*
X1475584Y1352156D01*
X1475410Y1351736D01*
X1472310Y1352352D01*
Y1358010D01*
X1448690D01*
Y1334390D01*
X1453583D01*
Y1317678D01*
X1452077Y1316523D01*
X1450184Y1314056D01*
X1448994Y1311183D01*
X1448588Y1308100D01*
X1448994Y1305017D01*
X1450184Y1302144D01*
X1452077Y1299677D01*
X1454544Y1297784D01*
X1457417Y1296594D01*
X1460500Y1296188D01*
X1463583Y1296594D01*
X1466456Y1297784D01*
X1468923Y1299677D01*
X1470816Y1302144D01*
X1472006Y1305017D01*
X1472412Y1308100D01*
X1472006Y1311183D01*
X1470816Y1314056D01*
X1468923Y1316523D01*
X1467417Y1317678D01*
Y1334390D01*
X1472310D01*
Y1340047D01*
X1475410Y1340664D01*
X1475584Y1340244D01*
X1477477Y1337777D01*
X1479944Y1335884D01*
X1482817Y1334694D01*
X1485900Y1334288D01*
X1488983Y1334694D01*
X1491856Y1335884D01*
X1494323Y1337777D01*
X1496216Y1340244D01*
X1496930Y1341968D01*
X1500270D01*
X1500984Y1340244D01*
X1502877Y1337777D01*
X1505344Y1335884D01*
X1508217Y1334694D01*
X1511300Y1334288D01*
X1514383Y1334694D01*
X1517256Y1335884D01*
X1519723Y1337777D01*
X1521616Y1340244D01*
X1522806Y1343117D01*
X1523212Y1346200D01*
X1522806Y1349283D01*
X1521616Y1352156D01*
X1519723Y1354623D01*
X1517256Y1356516D01*
X1514383Y1357706D01*
X1511899Y1358033D01*
X1510964Y1359642D01*
X1510633Y1361151D01*
X1554291Y1404809D01*
X1555390Y1406241D01*
X1556082Y1407910D01*
X1556317Y1409700D01*
Y1450922D01*
X1557823Y1452077D01*
X1559716Y1454544D01*
X1560906Y1457417D01*
X1561312Y1460500D01*
X1560906Y1463583D01*
X1559716Y1466456D01*
X1557823Y1468923D01*
X1555356Y1470816D01*
X1552483Y1472006D01*
X1549400Y1472412D01*
D02*
G37*
G36*
X1651000Y1218412D02*
X1647917Y1218006D01*
X1645044Y1216816D01*
X1642577Y1214923D01*
X1640684Y1212456D01*
X1639494Y1209583D01*
X1639088Y1206500D01*
X1639494Y1203417D01*
X1640684Y1200544D01*
X1642577Y1198077D01*
X1644083Y1196922D01*
Y1177348D01*
X1642934Y1176466D01*
X1641121Y1174104D01*
X1639981Y1171352D01*
X1639592Y1168400D01*
X1639981Y1165447D01*
X1641121Y1162696D01*
X1642934Y1160334D01*
X1645296Y1158521D01*
X1648047Y1157381D01*
X1651000Y1156992D01*
X1653952Y1157381D01*
X1656704Y1158521D01*
X1659066Y1160334D01*
X1660879Y1162696D01*
X1662019Y1165447D01*
X1662408Y1168400D01*
X1662019Y1171352D01*
X1660879Y1174104D01*
X1659066Y1176466D01*
X1657917Y1177348D01*
Y1196922D01*
X1659423Y1198077D01*
X1660578Y1199583D01*
X1724335D01*
X1726899Y1197019D01*
X1726475Y1193800D01*
X1726933Y1190325D01*
X1728274Y1187088D01*
X1730407Y1184307D01*
X1733188Y1182174D01*
X1736425Y1180833D01*
X1739900Y1180375D01*
X1743375Y1180833D01*
X1746612Y1182174D01*
X1749393Y1184307D01*
X1751526Y1187088D01*
X1752867Y1190325D01*
X1753325Y1193800D01*
X1752867Y1197275D01*
X1751526Y1200512D01*
X1749393Y1203293D01*
X1746612Y1205426D01*
X1743375Y1206767D01*
X1739900Y1207225D01*
X1736681Y1206801D01*
X1732091Y1211391D01*
X1730659Y1212490D01*
X1728990Y1213182D01*
X1727200Y1213417D01*
X1660578D01*
X1659423Y1214923D01*
X1656956Y1216816D01*
X1654083Y1218006D01*
X1651000Y1218412D01*
D02*
G37*
G36*
X1701800Y1179808D02*
X1698848Y1179419D01*
X1696096Y1178279D01*
X1693734Y1176466D01*
X1691921Y1174104D01*
X1690781Y1171352D01*
X1690392Y1168400D01*
X1690781Y1165447D01*
X1691921Y1162696D01*
X1693734Y1160334D01*
X1696096Y1158521D01*
X1698848Y1157381D01*
X1701800Y1156992D01*
X1704753Y1157381D01*
X1707504Y1158521D01*
X1709866Y1160334D01*
X1711679Y1162696D01*
X1712819Y1165447D01*
X1713208Y1168400D01*
X1712819Y1171352D01*
X1711679Y1174104D01*
X1709866Y1176466D01*
X1707504Y1178279D01*
X1704753Y1179419D01*
X1701800Y1179808D01*
D02*
G37*
G36*
X1600200D02*
X1597247Y1179419D01*
X1594496Y1178279D01*
X1592134Y1176466D01*
X1590321Y1174104D01*
X1589181Y1171352D01*
X1588792Y1168400D01*
X1589181Y1165447D01*
X1590321Y1162696D01*
X1592134Y1160334D01*
X1594496Y1158521D01*
X1597247Y1157381D01*
X1600200Y1156992D01*
X1603152Y1157381D01*
X1605904Y1158521D01*
X1608266Y1160334D01*
X1610079Y1162696D01*
X1611219Y1165447D01*
X1611608Y1168400D01*
X1611219Y1171352D01*
X1610079Y1174104D01*
X1608266Y1176466D01*
X1605904Y1178279D01*
X1603152Y1179419D01*
X1600200Y1179808D01*
D02*
G37*
G36*
X901700Y1154912D02*
X898617Y1154506D01*
X895744Y1153316D01*
X893277Y1151423D01*
X892122Y1149917D01*
X847148D01*
X846266Y1151066D01*
X843904Y1152879D01*
X841152Y1154019D01*
X838200Y1154408D01*
X835247Y1154019D01*
X832496Y1152879D01*
X830134Y1151066D01*
X828321Y1148704D01*
X827181Y1145953D01*
X826793Y1143000D01*
X827181Y1140048D01*
X828321Y1137296D01*
X830134Y1134934D01*
X832496Y1133121D01*
X835247Y1131981D01*
X838200Y1131592D01*
X841152Y1131981D01*
X843904Y1133121D01*
X846266Y1134934D01*
X847148Y1136083D01*
X892122D01*
X893277Y1134577D01*
X895744Y1132684D01*
X898617Y1131494D01*
X901700Y1131088D01*
X904783Y1131494D01*
X907656Y1132684D01*
X910123Y1134577D01*
X912016Y1137044D01*
X913206Y1139917D01*
X913612Y1143000D01*
X913206Y1146083D01*
X912016Y1148956D01*
X910123Y1151423D01*
X907656Y1153316D01*
X904783Y1154506D01*
X901700Y1154912D01*
D02*
G37*
G36*
X1003300D02*
X1000217Y1154506D01*
X997344Y1153316D01*
X994877Y1151423D01*
X992984Y1148956D01*
X991794Y1146083D01*
X991388Y1143000D01*
X991794Y1139917D01*
X992984Y1137044D01*
X994877Y1134577D01*
X997344Y1132684D01*
X1000217Y1131494D01*
X1003300Y1131088D01*
X1006383Y1131494D01*
X1009256Y1132684D01*
X1011723Y1134577D01*
X1013616Y1137044D01*
X1014806Y1139917D01*
X1015212Y1143000D01*
X1014806Y1146083D01*
X1013616Y1148956D01*
X1011723Y1151423D01*
X1009256Y1153316D01*
X1006383Y1154506D01*
X1003300Y1154912D01*
D02*
G37*
G36*
X1701800Y1129007D02*
X1698848Y1128619D01*
X1696096Y1127479D01*
X1693734Y1125666D01*
X1691921Y1123304D01*
X1690781Y1120553D01*
X1690392Y1117600D01*
X1690781Y1114648D01*
X1691921Y1111896D01*
X1693734Y1109534D01*
X1696096Y1107721D01*
X1698848Y1106581D01*
X1701800Y1106192D01*
X1704753Y1106581D01*
X1707504Y1107721D01*
X1709866Y1109534D01*
X1711679Y1111896D01*
X1712819Y1114648D01*
X1713208Y1117600D01*
X1712819Y1120553D01*
X1711679Y1123304D01*
X1709866Y1125666D01*
X1707504Y1127479D01*
X1704753Y1128619D01*
X1701800Y1129007D01*
D02*
G37*
G36*
X1600200D02*
X1597247Y1128619D01*
X1594496Y1127479D01*
X1592134Y1125666D01*
X1590321Y1123304D01*
X1589181Y1120553D01*
X1588792Y1117600D01*
X1589181Y1114648D01*
X1590321Y1111896D01*
X1592134Y1109534D01*
X1594496Y1107721D01*
X1597247Y1106581D01*
X1600200Y1106192D01*
X1603152Y1106581D01*
X1605904Y1107721D01*
X1608266Y1109534D01*
X1610079Y1111896D01*
X1611219Y1114648D01*
X1611608Y1117600D01*
X1611219Y1120553D01*
X1610079Y1123304D01*
X1608266Y1125666D01*
X1605904Y1127479D01*
X1603152Y1128619D01*
X1600200Y1129007D01*
D02*
G37*
G36*
X1549400Y1218412D02*
X1546317Y1218006D01*
X1543444Y1216816D01*
X1540977Y1214923D01*
X1539084Y1212456D01*
X1537894Y1209583D01*
X1537488Y1206500D01*
X1537894Y1203417D01*
X1539084Y1200544D01*
X1540977Y1198077D01*
X1542483Y1196922D01*
Y1158565D01*
X1487782Y1103864D01*
X1485900Y1104112D01*
X1482817Y1103706D01*
X1479944Y1102516D01*
X1477477Y1100623D01*
X1475584Y1098156D01*
X1475410Y1097736D01*
X1472310Y1098353D01*
Y1104010D01*
X1448690D01*
Y1080390D01*
X1453583D01*
Y1063678D01*
X1452077Y1062523D01*
X1450184Y1060056D01*
X1448994Y1057183D01*
X1448588Y1054100D01*
X1448994Y1051017D01*
X1450184Y1048144D01*
X1452077Y1045677D01*
X1454544Y1043784D01*
X1457417Y1042594D01*
X1460500Y1042188D01*
X1463583Y1042594D01*
X1466456Y1043784D01*
X1468923Y1045677D01*
X1470816Y1048144D01*
X1472006Y1051017D01*
X1472412Y1054100D01*
X1472006Y1057183D01*
X1470816Y1060056D01*
X1468923Y1062523D01*
X1467417Y1063678D01*
Y1080390D01*
X1472310D01*
Y1086048D01*
X1475410Y1086664D01*
X1475584Y1086244D01*
X1477477Y1083777D01*
X1479944Y1081884D01*
X1482817Y1080694D01*
X1485900Y1080288D01*
X1488983Y1080694D01*
X1491856Y1081884D01*
X1494323Y1083777D01*
X1496216Y1086244D01*
X1496930Y1087968D01*
X1500270D01*
X1500984Y1086244D01*
X1502877Y1083777D01*
X1505344Y1081884D01*
X1508217Y1080694D01*
X1511300Y1080288D01*
X1514383Y1080694D01*
X1517256Y1081884D01*
X1519723Y1083777D01*
X1521616Y1086244D01*
X1522806Y1089117D01*
X1523212Y1092200D01*
X1522806Y1095283D01*
X1521616Y1098156D01*
X1519723Y1100623D01*
X1517256Y1102516D01*
X1514383Y1103706D01*
X1511899Y1104033D01*
X1510964Y1105642D01*
X1510633Y1107151D01*
X1554291Y1150809D01*
X1555390Y1152241D01*
X1556082Y1153910D01*
X1556317Y1155700D01*
Y1196922D01*
X1557823Y1198077D01*
X1559716Y1200544D01*
X1560906Y1203417D01*
X1561312Y1206500D01*
X1560906Y1209583D01*
X1559716Y1212456D01*
X1557823Y1214923D01*
X1555356Y1216816D01*
X1552483Y1218006D01*
X1549400Y1218412D01*
D02*
G37*
G36*
X904240Y1104112D02*
X901157Y1103706D01*
X898284Y1102516D01*
X895817Y1100623D01*
X894662Y1099117D01*
X847148D01*
X846266Y1100266D01*
X843904Y1102079D01*
X841152Y1103219D01*
X838200Y1103608D01*
X835247Y1103219D01*
X832496Y1102079D01*
X830134Y1100266D01*
X828321Y1097904D01*
X827181Y1095153D01*
X826793Y1092200D01*
X827181Y1089248D01*
X828321Y1086496D01*
X830134Y1084134D01*
X832496Y1082321D01*
X835247Y1081181D01*
X838200Y1080792D01*
X841152Y1081181D01*
X843904Y1082321D01*
X846266Y1084134D01*
X847148Y1085283D01*
X894662D01*
X895817Y1083777D01*
X898284Y1081884D01*
X901157Y1080694D01*
X904240Y1080288D01*
X907323Y1080694D01*
X910196Y1081884D01*
X912663Y1083777D01*
X914556Y1086244D01*
X915746Y1089117D01*
X916152Y1092200D01*
X915746Y1095283D01*
X914556Y1098156D01*
X912663Y1100623D01*
X910196Y1102516D01*
X907323Y1103706D01*
X904240Y1104112D01*
D02*
G37*
G36*
X1005840D02*
X1002757Y1103706D01*
X999884Y1102516D01*
X997417Y1100623D01*
X995524Y1098156D01*
X994334Y1095283D01*
X993928Y1092200D01*
X994334Y1089117D01*
X995524Y1086244D01*
X997417Y1083777D01*
X999884Y1081884D01*
X1002757Y1080694D01*
X1005840Y1080288D01*
X1008923Y1080694D01*
X1011796Y1081884D01*
X1014263Y1083777D01*
X1016156Y1086244D01*
X1017346Y1089117D01*
X1017752Y1092200D01*
X1017346Y1095283D01*
X1016156Y1098156D01*
X1014263Y1100623D01*
X1011796Y1102516D01*
X1008923Y1103706D01*
X1005840Y1104112D01*
D02*
G37*
G36*
X904240Y1053312D02*
X901157Y1052906D01*
X898284Y1051716D01*
X895817Y1049823D01*
X894662Y1048317D01*
X847148D01*
X846266Y1049466D01*
X843904Y1051279D01*
X841152Y1052419D01*
X838200Y1052808D01*
X835247Y1052419D01*
X832496Y1051279D01*
X830134Y1049466D01*
X828321Y1047104D01*
X827181Y1044352D01*
X826793Y1041400D01*
X827181Y1038447D01*
X828321Y1035696D01*
X830134Y1033334D01*
X832496Y1031521D01*
X835247Y1030381D01*
X838200Y1029992D01*
X841152Y1030381D01*
X843904Y1031521D01*
X846266Y1033334D01*
X847148Y1034483D01*
X894662D01*
X895817Y1032977D01*
X898284Y1031084D01*
X901157Y1029894D01*
X904240Y1029488D01*
X907323Y1029894D01*
X910196Y1031084D01*
X912663Y1032977D01*
X914556Y1035444D01*
X915746Y1038317D01*
X916152Y1041400D01*
X915746Y1044483D01*
X914556Y1047356D01*
X912663Y1049823D01*
X910196Y1051716D01*
X907323Y1052906D01*
X904240Y1053312D01*
D02*
G37*
G36*
X1005840D02*
X1002757Y1052906D01*
X999884Y1051716D01*
X997417Y1049823D01*
X995524Y1047356D01*
X994334Y1044483D01*
X993928Y1041400D01*
X994334Y1038317D01*
X995524Y1035444D01*
X997417Y1032977D01*
X999884Y1031084D01*
X1002757Y1029894D01*
X1005840Y1029488D01*
X1008923Y1029894D01*
X1011796Y1031084D01*
X1014263Y1032977D01*
X1016156Y1035444D01*
X1017346Y1038317D01*
X1017752Y1041400D01*
X1017346Y1044483D01*
X1016156Y1047356D01*
X1014263Y1049823D01*
X1011796Y1051716D01*
X1008923Y1052906D01*
X1005840Y1053312D01*
D02*
G37*
G36*
X1008380Y1002512D02*
X1005297Y1002106D01*
X1002424Y1000916D01*
X999957Y999023D01*
X998064Y996556D01*
X996874Y993683D01*
X996468Y990600D01*
X996874Y987517D01*
X998064Y984644D01*
X999957Y982177D01*
X1002424Y980284D01*
X1005297Y979094D01*
X1008380Y978688D01*
X1011463Y979094D01*
X1014336Y980284D01*
X1016803Y982177D01*
X1018696Y984644D01*
X1019886Y987517D01*
X1020292Y990600D01*
X1019886Y993683D01*
X1018696Y996556D01*
X1016803Y999023D01*
X1014336Y1000916D01*
X1011463Y1002106D01*
X1008380Y1002512D01*
D02*
G37*
G36*
X1651000Y977112D02*
X1647917Y976706D01*
X1645044Y975516D01*
X1642577Y973623D01*
X1640684Y971156D01*
X1639494Y968283D01*
X1639088Y965200D01*
X1639494Y962117D01*
X1640684Y959244D01*
X1642577Y956777D01*
X1644083Y955622D01*
Y936048D01*
X1642934Y935166D01*
X1641121Y932804D01*
X1639981Y930052D01*
X1639592Y927100D01*
X1639981Y924147D01*
X1641121Y921396D01*
X1642934Y919034D01*
X1645296Y917221D01*
X1648047Y916081D01*
X1651000Y915693D01*
X1653952Y916081D01*
X1656704Y917221D01*
X1659066Y919034D01*
X1660879Y921396D01*
X1662019Y924147D01*
X1662408Y927100D01*
X1662019Y930052D01*
X1660879Y932804D01*
X1659066Y935166D01*
X1657917Y936048D01*
Y955622D01*
X1659423Y956777D01*
X1660578Y958283D01*
X1724335D01*
X1726899Y955719D01*
X1726475Y952500D01*
X1726933Y949025D01*
X1728274Y945788D01*
X1730407Y943007D01*
X1733188Y940874D01*
X1736425Y939533D01*
X1739900Y939075D01*
X1743375Y939533D01*
X1746612Y940874D01*
X1749393Y943007D01*
X1751526Y945788D01*
X1752867Y949025D01*
X1753325Y952500D01*
X1752867Y955975D01*
X1751526Y959212D01*
X1749393Y961993D01*
X1746612Y964126D01*
X1743375Y965467D01*
X1739900Y965925D01*
X1736681Y965501D01*
X1732091Y970091D01*
X1730659Y971190D01*
X1728990Y971881D01*
X1727200Y972117D01*
X1660578D01*
X1659423Y973623D01*
X1656956Y975516D01*
X1654083Y976706D01*
X1651000Y977112D01*
D02*
G37*
G36*
X1701800Y938508D02*
X1698848Y938119D01*
X1696096Y936979D01*
X1693734Y935166D01*
X1691921Y932804D01*
X1690781Y930052D01*
X1690392Y927100D01*
X1690781Y924147D01*
X1691921Y921396D01*
X1693734Y919034D01*
X1696096Y917221D01*
X1698848Y916081D01*
X1701800Y915693D01*
X1704753Y916081D01*
X1707504Y917221D01*
X1709866Y919034D01*
X1711679Y921396D01*
X1712819Y924147D01*
X1713208Y927100D01*
X1712819Y930052D01*
X1711679Y932804D01*
X1709866Y935166D01*
X1707504Y936979D01*
X1704753Y938119D01*
X1701800Y938508D01*
D02*
G37*
G36*
X1600200D02*
X1597247Y938119D01*
X1594496Y936979D01*
X1592134Y935166D01*
X1590321Y932804D01*
X1589181Y930052D01*
X1588792Y927100D01*
X1589181Y924147D01*
X1590321Y921396D01*
X1592134Y919034D01*
X1594496Y917221D01*
X1597247Y916081D01*
X1600200Y915693D01*
X1603152Y916081D01*
X1605904Y917221D01*
X1608266Y919034D01*
X1610079Y921396D01*
X1611219Y924147D01*
X1611608Y927100D01*
X1611219Y930052D01*
X1610079Y932804D01*
X1608266Y935166D01*
X1605904Y936979D01*
X1603152Y938119D01*
X1600200Y938508D01*
D02*
G37*
G36*
X2087423Y940814D02*
X2083818Y940339D01*
X2080458Y938947D01*
X2077573Y936734D01*
X2075360Y933849D01*
X2073968Y930490D01*
X2073494Y926884D01*
X2073968Y923279D01*
X2075360Y919920D01*
X2077573Y917035D01*
X2080458Y914821D01*
X2083818Y913430D01*
X2087423Y912955D01*
X2091028Y913430D01*
X2094387Y914821D01*
X2097272Y917035D01*
X2099486Y919920D01*
X2100877Y923279D01*
X2101352Y926884D01*
X2100877Y930490D01*
X2099486Y933849D01*
X2097272Y936734D01*
X2094387Y938947D01*
X2091028Y940339D01*
X2087423Y940814D01*
D02*
G37*
G36*
X1701800Y887708D02*
X1698848Y887319D01*
X1696096Y886179D01*
X1693734Y884366D01*
X1691921Y882004D01*
X1690781Y879252D01*
X1690392Y876300D01*
X1690781Y873347D01*
X1691921Y870596D01*
X1693734Y868234D01*
X1696096Y866421D01*
X1698848Y865281D01*
X1701800Y864892D01*
X1704753Y865281D01*
X1707504Y866421D01*
X1709866Y868234D01*
X1711679Y870596D01*
X1712819Y873347D01*
X1713208Y876300D01*
X1712819Y879252D01*
X1711679Y882004D01*
X1709866Y884366D01*
X1707504Y886179D01*
X1704753Y887319D01*
X1701800Y887708D01*
D02*
G37*
G36*
X1600200D02*
X1597247Y887319D01*
X1594496Y886179D01*
X1592134Y884366D01*
X1590321Y882004D01*
X1589181Y879252D01*
X1588792Y876300D01*
X1589181Y873347D01*
X1590321Y870596D01*
X1592134Y868234D01*
X1594496Y866421D01*
X1597247Y865281D01*
X1600200Y864892D01*
X1603152Y865281D01*
X1605904Y866421D01*
X1608266Y868234D01*
X1610079Y870596D01*
X1611219Y873347D01*
X1611608Y876300D01*
X1611219Y879252D01*
X1610079Y882004D01*
X1608266Y884366D01*
X1605904Y886179D01*
X1603152Y887319D01*
X1600200Y887708D01*
D02*
G37*
G36*
X1549400Y977112D02*
X1546317Y976706D01*
X1543444Y975516D01*
X1540977Y973623D01*
X1539084Y971156D01*
X1537894Y968283D01*
X1537488Y965200D01*
X1537894Y962117D01*
X1539084Y959244D01*
X1540977Y956777D01*
X1542483Y955622D01*
Y917265D01*
X1487782Y862564D01*
X1485900Y862812D01*
X1482817Y862406D01*
X1479944Y861216D01*
X1477477Y859323D01*
X1475584Y856856D01*
X1475410Y856436D01*
X1472310Y857053D01*
Y862710D01*
X1448690D01*
Y839090D01*
X1453583D01*
Y822378D01*
X1452077Y821223D01*
X1450184Y818756D01*
X1448994Y815883D01*
X1448588Y812800D01*
X1448994Y809717D01*
X1450184Y806844D01*
X1452077Y804377D01*
X1454544Y802484D01*
X1457417Y801294D01*
X1460500Y800888D01*
X1463583Y801294D01*
X1466456Y802484D01*
X1468923Y804377D01*
X1470816Y806844D01*
X1472006Y809717D01*
X1472412Y812800D01*
X1472006Y815883D01*
X1470816Y818756D01*
X1468923Y821223D01*
X1467417Y822378D01*
Y839090D01*
X1472310D01*
Y844747D01*
X1475410Y845364D01*
X1475584Y844944D01*
X1477477Y842477D01*
X1479944Y840584D01*
X1482817Y839394D01*
X1485900Y838988D01*
X1488983Y839394D01*
X1491856Y840584D01*
X1494323Y842477D01*
X1496216Y844944D01*
X1496930Y846668D01*
X1500270D01*
X1500984Y844944D01*
X1502877Y842477D01*
X1505344Y840584D01*
X1508217Y839394D01*
X1511300Y838988D01*
X1514383Y839394D01*
X1517256Y840584D01*
X1519723Y842477D01*
X1521616Y844944D01*
X1522806Y847817D01*
X1523212Y850900D01*
X1522806Y853983D01*
X1521616Y856856D01*
X1519723Y859323D01*
X1517256Y861216D01*
X1514383Y862406D01*
X1511899Y862733D01*
X1510964Y864342D01*
X1510633Y865851D01*
X1554291Y909509D01*
X1555390Y910941D01*
X1556082Y912610D01*
X1556317Y914400D01*
Y955622D01*
X1557823Y956777D01*
X1559716Y959244D01*
X1560906Y962117D01*
X1561312Y965200D01*
X1560906Y968283D01*
X1559716Y971156D01*
X1557823Y973623D01*
X1555356Y975516D01*
X1552483Y976706D01*
X1549400Y977112D01*
D02*
G37*
%LPD*%
D12*
X1482725Y338058D02*
X1485143Y339267D01*
X1488771Y342895D01*
Y317500D01*
D14*
X1483272Y386257D02*
X1496739Y372789D01*
X1478783Y381768D02*
X1487761Y390746D01*
X1497060Y391067D02*
X1496418Y389143D01*
Y386577D01*
X1497701Y384012D01*
X1498984Y382729D01*
X1501549Y381447D01*
X1504114D01*
X1506038Y382088D01*
X1507962Y384012D01*
X1508603Y385936D01*
X1508603Y388501D01*
X1507321Y391067D01*
X1506038Y392349D01*
X1503473Y393632D01*
X1500908Y393632D01*
X1498984Y392990D01*
X1497060Y391067D01*
X1505140Y399147D02*
X1518608Y385680D01*
X1507064Y397223D02*
Y399788D01*
X1507706Y401712D01*
X1509630Y403636D01*
X1511553Y404277D01*
X1514119D01*
X1516684Y402995D01*
X1517966Y401712D01*
X1519249Y399147D01*
Y396582D01*
X1518608Y394658D01*
X1516684Y392734D01*
X1514760Y392093D01*
X1512195D01*
X1521814Y424799D02*
X1535282Y411332D01*
X1542978Y419028D01*
X1543170Y437177D02*
X1552148Y428198D01*
X1545094Y435253D02*
X1542529Y435253D01*
X1540605Y434611D01*
X1538681Y432687D01*
X1538040Y430764D01*
Y428198D01*
X1539322Y425633D01*
X1540605Y424350D01*
X1543170Y423068D01*
X1545735D01*
X1547659Y423709D01*
X1549583Y425633D01*
X1550224Y427557D01*
X1550224Y430122D01*
X1547403Y441409D02*
X1560229Y436279D01*
X1555098Y449105D02*
X1560229Y436279D01*
X1561511Y432431D01*
Y429866D01*
X1560870Y427942D01*
X1560229Y427300D01*
X1561191Y447502D02*
X1568887Y455197D01*
X1567604Y456480D01*
X1565680Y457121D01*
X1564397D01*
X1562473Y456480D01*
X1560549Y454556D01*
X1559908Y452632D01*
Y450067D01*
X1561191Y447502D01*
X1562473Y446219D01*
X1565039Y444936D01*
X1567604D01*
X1569528Y445578D01*
X1571452Y447502D01*
X1572093Y449426D01*
X1572093Y451991D01*
X1567924Y461931D02*
X1576903Y452953D01*
X1571772Y458083D02*
X1570490Y460648D01*
Y463214D01*
X1571131Y465138D01*
X1573055Y467062D01*
D15*
X906780Y990600D02*
D03*
X1008380D02*
D03*
X1485900Y927100D02*
D03*
X1460500D02*
D03*
X1511300D02*
D03*
Y850900D02*
D03*
X1485900D02*
D03*
Y1590040D02*
D03*
X1511300D02*
D03*
Y1666240D02*
D03*
X1460500D02*
D03*
X1485900D02*
D03*
X1511300Y1704340D02*
D03*
X1409700D02*
D03*
X1460500Y1551940D02*
D03*
X1562100D02*
D03*
X1485900Y1346200D02*
D03*
X1511300D02*
D03*
Y1422400D02*
D03*
X1460500D02*
D03*
X1485900D02*
D03*
Y1092200D02*
D03*
X1511300D02*
D03*
Y1168400D02*
D03*
X1460500D02*
D03*
X1485900D02*
D03*
X1549400Y1704340D02*
D03*
X1651000D02*
D03*
X1003300Y1143000D02*
D03*
X901700D02*
D03*
X1460500Y1308100D02*
D03*
X1562100D02*
D03*
X1549400Y1460500D02*
D03*
X1651000D02*
D03*
X1511300D02*
D03*
X1409700D02*
D03*
X1005840Y1092200D02*
D03*
X904240D02*
D03*
X1460500Y1054100D02*
D03*
X1562100D02*
D03*
X1549400Y1206500D02*
D03*
X1651000D02*
D03*
X1511300D02*
D03*
X1409700D02*
D03*
X1005840Y1041400D02*
D03*
X904240D02*
D03*
X1562100Y812800D02*
D03*
X1460500D02*
D03*
X1651000Y965200D02*
D03*
X1549400D02*
D03*
X1409700D02*
D03*
X1511300D02*
D03*
X1328420Y1292860D02*
D03*
X1303020D02*
D03*
D16*
X1651000Y876300D02*
D03*
X1600200D02*
D03*
X1701800Y927100D02*
D03*
Y876300D02*
D03*
X1651000Y927100D02*
D03*
X1600200D02*
D03*
X838200Y990600D02*
D03*
Y1016000D02*
D03*
Y1168400D02*
D03*
Y1143000D02*
D03*
Y1117600D02*
D03*
Y1092200D02*
D03*
Y1066800D02*
D03*
Y1041400D02*
D03*
X1600200Y1666240D02*
D03*
X1651000D02*
D03*
X1701800Y1615440D02*
D03*
Y1666240D02*
D03*
X1600200Y1615440D02*
D03*
X1651000D02*
D03*
X1600200Y1422400D02*
D03*
X1651000D02*
D03*
X1701800Y1371600D02*
D03*
Y1422400D02*
D03*
X1600200Y1371600D02*
D03*
X1651000D02*
D03*
X1600200Y1168400D02*
D03*
X1651000D02*
D03*
X1701800Y1117600D02*
D03*
Y1168400D02*
D03*
X1600200Y1117600D02*
D03*
X1651000D02*
D03*
D17*
X905500Y1571600D02*
D03*
X825500D02*
D03*
X905500Y1321700D02*
D03*
X825500D02*
D03*
D18*
X893000Y1460500D02*
D03*
X921400Y1391250D02*
D03*
Y1418950D02*
D03*
Y1446650D02*
D03*
Y1474350D02*
D03*
Y1502050D02*
D03*
X893000Y1488200D02*
D03*
Y1432800D02*
D03*
Y1405100D02*
D03*
X825500Y1460500D02*
D03*
X853900Y1391250D02*
D03*
Y1418950D02*
D03*
Y1446650D02*
D03*
Y1474350D02*
D03*
Y1502050D02*
D03*
X825500Y1488200D02*
D03*
Y1432800D02*
D03*
Y1405100D02*
D03*
X1739900Y952500D02*
D03*
Y850900D02*
D03*
Y1590040D02*
D03*
Y1691640D02*
D03*
Y1346200D02*
D03*
Y1447800D02*
D03*
Y1092200D02*
D03*
Y1193800D02*
D03*
D20*
X2311400Y1663700D02*
D03*
Y1638300D02*
D03*
Y1612900D02*
D03*
Y1587500D02*
D03*
Y1562100D02*
D03*
Y1536700D02*
D03*
Y1511300D02*
D03*
Y1485900D02*
D03*
Y1282700D02*
D03*
Y1308100D02*
D03*
Y1333500D02*
D03*
Y1358900D02*
D03*
Y1384300D02*
D03*
Y1409700D02*
D03*
Y1435100D02*
D03*
Y1460500D02*
D03*
Y1079500D02*
D03*
Y1104900D02*
D03*
Y1130300D02*
D03*
Y1155700D02*
D03*
Y1181100D02*
D03*
Y1206500D02*
D03*
Y1231900D02*
D03*
Y1257300D02*
D03*
Y876300D02*
D03*
Y901700D02*
D03*
Y927100D02*
D03*
Y952500D02*
D03*
Y977900D02*
D03*
Y1003300D02*
D03*
Y1028700D02*
D03*
Y1054100D02*
D03*
X2260600D02*
D03*
Y1028700D02*
D03*
Y1003300D02*
D03*
Y977900D02*
D03*
Y952500D02*
D03*
Y927100D02*
D03*
Y901700D02*
D03*
Y876300D02*
D03*
Y1257300D02*
D03*
Y1231900D02*
D03*
Y1206500D02*
D03*
Y1181100D02*
D03*
Y1155700D02*
D03*
Y1130300D02*
D03*
Y1104900D02*
D03*
Y1079500D02*
D03*
Y1460500D02*
D03*
Y1435100D02*
D03*
Y1409700D02*
D03*
Y1384300D02*
D03*
Y1358900D02*
D03*
Y1333500D02*
D03*
Y1308100D02*
D03*
Y1282700D02*
D03*
Y1485900D02*
D03*
Y1511300D02*
D03*
Y1536700D02*
D03*
Y1562100D02*
D03*
Y1587500D02*
D03*
Y1612900D02*
D03*
Y1638300D02*
D03*
Y1663700D02*
D03*
D21*
X2336800Y1714500D02*
D03*
Y825500D02*
D03*
D22*
X2144217Y927316D02*
D03*
X2087423Y926884D02*
D03*
D23*
X1460500Y850900D02*
D03*
Y1590040D02*
D03*
Y1346200D02*
D03*
Y1092200D02*
D03*
D24*
X800100Y825500D02*
D03*
Y1714500D02*
D03*
D25*
X876300Y1504900D02*
X893000Y1488200D01*
X876300Y1504900D02*
Y1524000D01*
X1651000Y927100D02*
Y965200D01*
X1727200D01*
X1739900Y952500D01*
X1651000Y1168400D02*
Y1206500D01*
X1727200D01*
X1739900Y1193800D01*
X1651000Y1422400D02*
Y1460500D01*
X1727200D01*
X1739900Y1447800D01*
X1651000Y1666240D02*
Y1704340D01*
X1727200D01*
X1739900Y1691640D01*
X838200Y990600D02*
X906780D01*
X838200Y1041400D02*
X904240D01*
X838200Y1092200D02*
X904240D01*
X838200Y1143000D02*
X901700D01*
X1447800Y998220D02*
X1478280D01*
X1409700Y1036320D02*
X1447800Y998220D01*
X1409700Y1036320D02*
Y1127760D01*
X1173480Y1363980D02*
X1409700Y1127760D01*
X1178560Y1376680D02*
X1303020Y1252220D01*
X935970Y1376680D02*
X1178560D01*
X921400Y1391250D02*
X935970Y1376680D01*
X914400Y1363980D02*
X1173480D01*
X1303020Y1252220D02*
X1470660D01*
X1384300Y1397000D02*
Y1628140D01*
X1303020Y1315720D02*
X1384300Y1397000D01*
X1303020Y1292860D02*
Y1315720D01*
X1384300Y1628140D02*
X1460500Y1704340D01*
X1328420Y1320800D02*
X1468120Y1460500D01*
X1328420Y1292860D02*
Y1320800D01*
X1478280Y998220D02*
X1511300Y965200D01*
X893000Y1385380D02*
X914400Y1363980D01*
X1460500Y812800D02*
Y850900D01*
Y1704340D02*
X1511300D01*
X1468120Y1460500D02*
X1511300D01*
X893000Y1385380D02*
Y1405100D01*
Y1432800D01*
Y1460500D01*
X1511300Y1206500D02*
Y1211580D01*
X1470660Y1252220D02*
X1511300Y1211580D01*
X921400Y1391250D02*
Y1418950D01*
Y1446650D01*
Y1474350D01*
X1511300Y927100D02*
Y965200D01*
Y1168400D02*
Y1206500D01*
Y1422400D02*
Y1460500D01*
Y1666240D02*
Y1704340D01*
X1485900Y1590040D02*
X1549400Y1653540D01*
Y1704340D01*
X1460500Y1551940D02*
Y1590040D01*
X1485900Y1346200D02*
X1549400Y1409700D01*
Y1460500D01*
X1460500Y1308100D02*
Y1346200D01*
X1485900Y1092200D02*
X1549400Y1155700D01*
Y1206500D01*
X1460500Y1054100D02*
Y1092200D01*
X1485900Y850900D02*
X1549400Y914400D01*
Y965200D01*
X1831340Y1381760D02*
X2037080Y1587500D01*
X1831340Y1381760D02*
X1831340Y942340D01*
X1739900Y850900D02*
X1831340Y942340D01*
X2034540Y1612900D02*
X2260600D01*
X1811020Y1389380D02*
X2034540Y1612900D01*
X1811020Y1163320D02*
Y1389380D01*
X2037080Y1587500D02*
X2260600D01*
X1587500Y812800D02*
X1651000Y876300D01*
X1562100Y812800D02*
X1587500D01*
X1651000Y876300D02*
X1676400Y850900D01*
X1739900D01*
X2260600Y1587500D02*
X2311400D01*
X1562100Y1054100D02*
X1587500D01*
X1651000Y1117600D01*
X1676400Y1092200D01*
X1739900D01*
X1811020Y1163320D01*
X2260600Y1612900D02*
X2311400D01*
X1587500Y1308100D02*
X1651000Y1371600D01*
X1562100Y1308100D02*
X1587500D01*
X1651000Y1371600D02*
X1676400Y1346200D01*
X1739900D01*
X2032000Y1638300D01*
X2260600D01*
X2311400D01*
X1587500Y1551940D02*
X1651000Y1615440D01*
X1562100Y1551940D02*
X1587500D01*
X1651000Y1615440D02*
X1676400Y1590040D01*
X1739900D01*
X1813560Y1663700D01*
X2260600D01*
X2311400D01*
D26*
X2144217Y927316D02*
X2144433Y927100D01*
X2260600D01*
X2311400D01*
D27*
X812800Y1003300D02*
D03*
Y1155700D02*
D03*
Y1104900D02*
D03*
Y1054100D02*
D03*
M02*
