%TF.GenerationSoftware,Altium Limited,Altium Designer,19.1.5 (86)*%
G04 Layer_Color=8388736*
%FSLAX45Y45*%
%MOMM*%
%TF.FileFunction,Other,Panelisation2*%
%TF.Part,Single*%
G01*
G75*
%TF.MD5,31a4f07e9c28e494bca5283446159cf7*%
M02*
