%TF.GenerationSoftware,Altium Limited,Altium Designer,19.1.5 (86)*%
G04 Layer_Physical_Order=2*
G04 Layer_Color=16711680*
%FSLAX45Y45*%
%MOMM*%
%TF.FileFunction,Copper,L2,Bot,Signal*%
%TF.Part,Single*%
G01*
G75*
%TA.AperFunction,Conductor*%
%ADD10C,0.60960*%
%ADD11C,1.27000*%
%TA.AperFunction,NonConductor*%
%ADD12C,0.17780*%
%ADD13C,0.25400*%
%TA.AperFunction,ComponentPad*%
%ADD14C,1.60000*%
%ADD15C,1.50000*%
%ADD16C,3.75000*%
%ADD17C,1.90000*%
%ADD18C,0.50000*%
%ADD19C,1.70000*%
%ADD21C,2.00000*%
%ADD22R,1.60000X1.60000*%
%TA.AperFunction,ViaPad*%
%ADD23C,4.45000*%
%ADD24C,1.60000*%
%TA.AperFunction,Conductor*%
%ADD25C,0.25400*%
%ADD26C,0.30480*%
%TA.AperFunction,ComponentPad*%
%ADD27C,5.10000*%
G36*
X23063193Y16840202D02*
X23494987D01*
X23494995Y8585202D01*
X23063191Y8585202D01*
X23063193Y7874001D01*
X8585192Y7874003D01*
Y8788402D01*
X8178800Y8788402D01*
Y9948328D01*
X8197966Y9963034D01*
X8213690Y9983527D01*
X8223575Y10007391D01*
X8226946Y10033000D01*
X8223575Y10058609D01*
X8213690Y10082473D01*
X8197966Y10102966D01*
X8178800Y10117672D01*
Y10456328D01*
X8197966Y10471034D01*
X8213690Y10491527D01*
X8223575Y10515391D01*
X8226946Y10541000D01*
X8223575Y10566609D01*
X8213690Y10590473D01*
X8197966Y10610966D01*
X8178800Y10625672D01*
X8178800Y10964328D01*
X8197966Y10979034D01*
X8213690Y10999527D01*
X8223575Y11023391D01*
X8226946Y11049000D01*
X8223575Y11074609D01*
X8213690Y11098473D01*
X8197966Y11118966D01*
X8178800Y11133672D01*
Y11472328D01*
X8197966Y11487034D01*
X8213690Y11507527D01*
X8223575Y11531391D01*
X8226946Y11557000D01*
X8223575Y11582609D01*
X8213690Y11606473D01*
X8197966Y11626966D01*
X8178800Y11641672D01*
Y12903200D01*
X9372600Y12903200D01*
X9377510Y12908110D01*
Y13487399D01*
X9352110Y13512801D01*
X8001000D01*
Y15443201D01*
X9448800D01*
X9448799Y17576802D01*
X23063193Y17576802D01*
Y16840202D01*
D02*
G37*
G36*
X9374962Y17597662D02*
X9374561Y17596693D01*
X9371942Y17576802D01*
X9371942Y15520058D01*
X8001000D01*
X7981108Y15517439D01*
X7962571Y15509761D01*
X7946653Y15497546D01*
X7934439Y15481628D01*
X7926761Y15463092D01*
X7924142Y15443201D01*
Y13512801D01*
X7926761Y13492908D01*
X7934439Y13474371D01*
X7946653Y13458453D01*
X7962571Y13446239D01*
X7981108Y13438560D01*
X8001000Y13435942D01*
X9300653D01*
Y12980058D01*
X8178800Y12980057D01*
X8158907Y12977438D01*
X8140371Y12969760D01*
X8124453Y12957545D01*
X8112239Y12941629D01*
X8104561Y12923093D01*
X8101942Y12903200D01*
Y11652389D01*
X8078527Y11642690D01*
X8058034Y11626966D01*
X8042310Y11606473D01*
X8032425Y11582609D01*
X8029054Y11557000D01*
X8032425Y11531391D01*
X8042310Y11507527D01*
X8058034Y11487034D01*
X8078527Y11471310D01*
X8101942Y11461611D01*
Y11144389D01*
X8078527Y11134690D01*
X8058034Y11118966D01*
X8042310Y11098473D01*
X8032425Y11074609D01*
X8029054Y11049000D01*
X8032425Y11023391D01*
X8042310Y10999527D01*
X8058034Y10979034D01*
X8078527Y10963310D01*
X8101942Y10953611D01*
X8101942Y10636389D01*
X8078527Y10626690D01*
X8058034Y10610966D01*
X8042310Y10590473D01*
X8032425Y10566609D01*
X8029054Y10541000D01*
X8032425Y10515391D01*
X8042310Y10491527D01*
X8058034Y10471034D01*
X8078527Y10455310D01*
X8101942Y10445611D01*
Y10128389D01*
X8078527Y10118690D01*
X8058034Y10102966D01*
X8042310Y10082473D01*
X8032425Y10058609D01*
X8029054Y10033000D01*
X8032425Y10007391D01*
X8042310Y9983527D01*
X8058034Y9963034D01*
X8078527Y9947310D01*
X8101942Y9937611D01*
Y8788402D01*
X8104561Y8768510D01*
X8112239Y8749973D01*
X8124453Y8734055D01*
X8140371Y8721841D01*
X8158908Y8714163D01*
X8178800Y8711544D01*
X8508334Y8711545D01*
Y7874003D01*
X8508992Y7869007D01*
Y7749040D01*
X7693034D01*
Y17650955D01*
X9374962D01*
Y17597662D01*
D02*
G37*
%LPC*%
G36*
X16510001Y17162518D02*
X16479170Y17158459D01*
X16450441Y17146561D01*
X16425771Y17127631D01*
X16406841Y17102959D01*
X16394940Y17074229D01*
X16390881Y17043401D01*
X16394940Y17012570D01*
X16406841Y16983841D01*
X16425771Y16959171D01*
X16450441Y16940240D01*
X16479170Y16928340D01*
X16510001Y16924281D01*
X16540829Y16928340D01*
X16569559Y16940240D01*
X16594231Y16959171D01*
X16613161Y16983841D01*
X16625060Y17012570D01*
X16629118Y17043401D01*
X16625060Y17074229D01*
X16613161Y17102959D01*
X16594231Y17127631D01*
X16569559Y17146561D01*
X16540829Y17158459D01*
X16510001Y17162518D01*
D02*
G37*
G36*
X15494000D02*
X15463170Y17158459D01*
X15434441Y17146561D01*
X15409770Y17127631D01*
X15390840Y17102959D01*
X15378940Y17074229D01*
X15374881Y17043401D01*
X15378940Y17012570D01*
X15390840Y16983841D01*
X15409770Y16959171D01*
X15434441Y16940240D01*
X15427956Y16909372D01*
X15179044D01*
X15172560Y16940240D01*
X15197231Y16959171D01*
X15216161Y16983841D01*
X15228059Y17012570D01*
X15232120Y17043401D01*
X15228059Y17074229D01*
X15216161Y17102959D01*
X15197231Y17127631D01*
X15172559Y17146561D01*
X15143829Y17158459D01*
X15113000Y17162518D01*
X15082170Y17158459D01*
X15053441Y17146561D01*
X15028770Y17127631D01*
X15017216Y17112572D01*
X14605000D01*
X14587097Y17110216D01*
X14570415Y17103305D01*
X14556088Y17092313D01*
X13915456Y16451678D01*
X13901297Y16449815D01*
X13884615Y16442905D01*
X13870288Y16431912D01*
X12696748Y15258372D01*
X8984700D01*
X8966797Y15256015D01*
X8950114Y15249104D01*
X8935788Y15238112D01*
X8702445Y15004768D01*
X8673083Y15019247D01*
X8673248Y15020500D01*
X8668674Y15055246D01*
X8655262Y15087624D01*
X8633928Y15115428D01*
X8606124Y15136761D01*
X8573746Y15150174D01*
X8539000Y15154749D01*
X8504254Y15150174D01*
X8471876Y15136761D01*
X8444072Y15115428D01*
X8422738Y15087624D01*
X8409326Y15055246D01*
X8404752Y15020500D01*
X8409326Y14985754D01*
X8415675Y14970425D01*
X8370775Y14925525D01*
X8359547Y14908720D01*
X8355605Y14888901D01*
Y14833098D01*
X8260970Y14738463D01*
X8255000Y14739249D01*
X8220254Y14734674D01*
X8187876Y14721262D01*
X8160072Y14699928D01*
X8138738Y14672124D01*
X8125326Y14639746D01*
X8120752Y14605000D01*
X8125326Y14570255D01*
X8138738Y14537875D01*
X8160072Y14510072D01*
X8185828Y14490309D01*
Y14442691D01*
X8160072Y14422928D01*
X8138738Y14395123D01*
X8125326Y14362746D01*
X8120752Y14328000D01*
X8125326Y14293254D01*
X8138738Y14260876D01*
X8160072Y14233072D01*
X8185828Y14213309D01*
Y14165691D01*
X8160072Y14145927D01*
X8138738Y14118124D01*
X8125326Y14085745D01*
X8120752Y14050999D01*
X8125326Y14016254D01*
X8138738Y13983876D01*
X8160072Y13956071D01*
X8185828Y13936308D01*
Y13842999D01*
X8188185Y13825098D01*
X8195095Y13808414D01*
X8206088Y13794089D01*
X8409288Y13590887D01*
X8423614Y13579895D01*
X8440297Y13572984D01*
X8458200Y13570628D01*
X9321800D01*
X9339703Y13572984D01*
X9356386Y13579895D01*
X9370712Y13590887D01*
X9548512Y13768687D01*
X9559505Y13783014D01*
X9566415Y13799696D01*
X9568772Y13817599D01*
Y14779549D01*
X9807652Y15018428D01*
X14576347D01*
X14994502Y14600273D01*
X14997940Y14574170D01*
X15009840Y14545441D01*
X15028770Y14520770D01*
X15053439Y14501840D01*
X15046956Y14470972D01*
X15036800D01*
X15018896Y14468616D01*
X15002214Y14461705D01*
X14987888Y14450713D01*
X14877818Y14340640D01*
X14859000Y14343118D01*
X14828169Y14339059D01*
X14799442Y14327161D01*
X14774770Y14308231D01*
X14755840Y14283559D01*
X14748700Y14266322D01*
X14715300D01*
X14708160Y14283559D01*
X14689230Y14308231D01*
X14664558Y14327161D01*
X14635831Y14339059D01*
X14605000Y14343118D01*
X14574170Y14339059D01*
X14545441Y14327161D01*
X14520770Y14308231D01*
X14501840Y14283559D01*
X14489940Y14254829D01*
X14485881Y14224001D01*
X14489940Y14193170D01*
X14501840Y14164441D01*
X14520770Y14139771D01*
X14545441Y14120840D01*
X14574170Y14108940D01*
X14605000Y14104881D01*
X14635831Y14108940D01*
X14664558Y14120840D01*
X14689230Y14139771D01*
X14708160Y14164441D01*
X14715300Y14181677D01*
X14748700D01*
X14755840Y14164441D01*
X14774770Y14139771D01*
X14799442Y14120840D01*
X14828169Y14108940D01*
X14859000Y14104881D01*
X14889830Y14108940D01*
X14918559Y14120840D01*
X14943230Y14139771D01*
X14962160Y14164441D01*
X14969299Y14181677D01*
X15002699D01*
X15009840Y14164441D01*
X15028770Y14139771D01*
X15053441Y14120840D01*
X15082170Y14108940D01*
X15113000Y14104881D01*
X15143829Y14108940D01*
X15172559Y14120840D01*
X15197231Y14139771D01*
X15216161Y14164441D01*
X15228059Y14193170D01*
X15232120Y14224001D01*
X15228059Y14254829D01*
X15216161Y14283559D01*
X15202295Y14301628D01*
X15209465Y14323955D01*
X15216214Y14332628D01*
X15795547D01*
X15889815Y14238362D01*
X15887924Y14224001D01*
X15891811Y14194475D01*
X15903207Y14166962D01*
X15921336Y14143336D01*
X15944962Y14125208D01*
X15972475Y14113811D01*
X16002000Y14109924D01*
X16031525Y14113811D01*
X16059038Y14125208D01*
X16082664Y14143336D01*
X16100792Y14166962D01*
X16112189Y14194475D01*
X16116075Y14224001D01*
X16112189Y14253525D01*
X16100792Y14281038D01*
X16082664Y14304665D01*
X16059038Y14322794D01*
X16031525Y14334189D01*
X16002000Y14338075D01*
X15987637Y14336185D01*
X15873112Y14450713D01*
X15858786Y14461705D01*
X15842104Y14468616D01*
X15824200Y14470972D01*
X15560043D01*
X15553560Y14501840D01*
X15578230Y14520770D01*
X15597160Y14545441D01*
X15609061Y14574170D01*
X15613120Y14605000D01*
X15609061Y14635831D01*
X15597160Y14664558D01*
X15578230Y14689230D01*
X15553558Y14708160D01*
X15524831Y14720061D01*
X15494000Y14724120D01*
X15463170Y14720061D01*
X15434441Y14708160D01*
X15409770Y14689230D01*
X15390840Y14664558D01*
X15378940Y14635831D01*
X15374881Y14605000D01*
X15378940Y14574170D01*
X15390840Y14545441D01*
X15409770Y14520770D01*
X15434441Y14501840D01*
X15427956Y14470972D01*
X15179044D01*
X15172560Y14501840D01*
X15197231Y14520770D01*
X15216161Y14545441D01*
X15228059Y14574170D01*
X15232120Y14605000D01*
X15228059Y14635831D01*
X15216161Y14664558D01*
X15197231Y14689230D01*
X15172559Y14708160D01*
X15143829Y14720061D01*
X15113000Y14724120D01*
X15082170Y14720061D01*
X15073822Y14716602D01*
X14653912Y15136513D01*
X14639586Y15147505D01*
X14622903Y15154414D01*
X14605000Y15156772D01*
X12831297D01*
X12819435Y15185413D01*
X13948344Y16314320D01*
X13962503Y16316185D01*
X13979185Y16323096D01*
X13993512Y16334088D01*
X14633652Y16974228D01*
X15017216D01*
X15028770Y16959171D01*
X15053439Y16940240D01*
X15046956Y16909372D01*
X15036800D01*
X15018896Y16907014D01*
X15002214Y16900105D01*
X14987888Y16889111D01*
X14877818Y16779041D01*
X14859000Y16781519D01*
X14828169Y16777460D01*
X14799442Y16765559D01*
X14774770Y16746629D01*
X14755840Y16721959D01*
X14748700Y16704723D01*
X14715300D01*
X14708160Y16721959D01*
X14689230Y16746629D01*
X14664558Y16765559D01*
X14635831Y16777460D01*
X14605000Y16781519D01*
X14574170Y16777460D01*
X14545441Y16765559D01*
X14520770Y16746629D01*
X14501840Y16721959D01*
X14489940Y16693230D01*
X14485881Y16662399D01*
X14489940Y16631570D01*
X14501840Y16602841D01*
X14520770Y16578169D01*
X14545441Y16559241D01*
X14574170Y16547340D01*
X14605000Y16543282D01*
X14635831Y16547340D01*
X14664558Y16559241D01*
X14689230Y16578169D01*
X14708160Y16602841D01*
X14715300Y16620078D01*
X14748700D01*
X14755840Y16602841D01*
X14774770Y16578169D01*
X14799442Y16559241D01*
X14828169Y16547340D01*
X14859000Y16543282D01*
X14889830Y16547340D01*
X14918559Y16559241D01*
X14943230Y16578169D01*
X14962160Y16602841D01*
X14969299Y16620078D01*
X15002699D01*
X15009840Y16602841D01*
X15028770Y16578169D01*
X15053441Y16559241D01*
X15082170Y16547340D01*
X15113000Y16543282D01*
X15143829Y16547340D01*
X15172559Y16559241D01*
X15197231Y16578169D01*
X15216161Y16602841D01*
X15228059Y16631570D01*
X15232120Y16662399D01*
X15228059Y16693230D01*
X15216161Y16721959D01*
X15202295Y16740028D01*
X15209465Y16762355D01*
X15216214Y16771028D01*
X15779568D01*
X15887956Y16662640D01*
X15887924Y16662399D01*
X15891811Y16632875D01*
X15903207Y16605362D01*
X15921336Y16581737D01*
X15944962Y16563608D01*
X15972475Y16552211D01*
X16002000Y16548325D01*
X16031525Y16552211D01*
X16059038Y16563608D01*
X16082664Y16581737D01*
X16100792Y16605362D01*
X16112189Y16632875D01*
X16116075Y16662399D01*
X16112189Y16691925D01*
X16100792Y16719438D01*
X16082664Y16743063D01*
X16059038Y16761192D01*
X16031525Y16772589D01*
X16002000Y16776476D01*
X15973518Y16772726D01*
X15857132Y16889111D01*
X15842805Y16900105D01*
X15826123Y16907014D01*
X15808220Y16909372D01*
X15560043D01*
X15553560Y16940240D01*
X15578230Y16959171D01*
X15597160Y16983841D01*
X15609061Y17012570D01*
X15613120Y17043401D01*
X15609061Y17074229D01*
X15597160Y17102959D01*
X15578230Y17127631D01*
X15553558Y17146561D01*
X15524831Y17158459D01*
X15494000Y17162518D01*
D02*
G37*
G36*
X17017999Y16776476D02*
X16988475Y16772589D01*
X16960962Y16761192D01*
X16937337Y16743063D01*
X16919208Y16719438D01*
X16907811Y16691925D01*
X16903925Y16662399D01*
X16907811Y16632875D01*
X16919208Y16605362D01*
X16937337Y16581737D01*
X16960962Y16563608D01*
X16988475Y16552211D01*
X17017999Y16548325D01*
X17047525Y16552211D01*
X17075038Y16563608D01*
X17098663Y16581737D01*
X17116792Y16605362D01*
X17128189Y16632875D01*
X17132076Y16662399D01*
X17128189Y16691925D01*
X17116792Y16719438D01*
X17098663Y16743063D01*
X17075038Y16761192D01*
X17047525Y16772589D01*
X17017999Y16776476D01*
D02*
G37*
G36*
X16510001D02*
X16480475Y16772589D01*
X16452962Y16761192D01*
X16429337Y16743063D01*
X16411208Y16719438D01*
X16399811Y16691925D01*
X16395924Y16662399D01*
X16399811Y16632875D01*
X16411208Y16605363D01*
X16429337Y16581737D01*
X16452962Y16563608D01*
X16480475Y16552211D01*
X16510001Y16548325D01*
X16539525Y16552211D01*
X16567038Y16563608D01*
X16590665Y16581737D01*
X16608794Y16605363D01*
X16620189Y16632875D01*
X16624075Y16662399D01*
X16620189Y16691925D01*
X16608794Y16719438D01*
X16590665Y16743063D01*
X16567038Y16761192D01*
X16539525Y16772589D01*
X16510001Y16776476D01*
D02*
G37*
G36*
Y16268475D02*
X16480475Y16264589D01*
X16452962Y16253192D01*
X16429337Y16235065D01*
X16411208Y16211436D01*
X16399811Y16183925D01*
X16395924Y16154401D01*
X16399811Y16124875D01*
X16411208Y16097362D01*
X16429337Y16073737D01*
X16452962Y16055608D01*
X16480475Y16044211D01*
X16510001Y16040324D01*
X16539525Y16044211D01*
X16567038Y16055608D01*
X16590665Y16073737D01*
X16608794Y16097362D01*
X16620189Y16124875D01*
X16624075Y16154401D01*
X16620189Y16183925D01*
X16608794Y16211436D01*
X16590665Y16235065D01*
X16567038Y16253192D01*
X16539525Y16264589D01*
X16510001Y16268475D01*
D02*
G37*
G36*
X16002000D02*
X15972475Y16264589D01*
X15944962Y16253192D01*
X15921336Y16235065D01*
X15903207Y16211438D01*
X15891811Y16183925D01*
X15887924Y16154401D01*
X15891811Y16124875D01*
X15903207Y16097362D01*
X15921336Y16073737D01*
X15944962Y16055608D01*
X15972475Y16044211D01*
X16002000Y16040324D01*
X16031525Y16044211D01*
X16059038Y16055608D01*
X16082664Y16073737D01*
X16100792Y16097362D01*
X16112189Y16124875D01*
X16116075Y16154401D01*
X16112189Y16183925D01*
X16100792Y16211438D01*
X16082664Y16235065D01*
X16059038Y16253192D01*
X16031525Y16264589D01*
X16002000Y16268475D01*
D02*
G37*
G36*
X15113000Y16019519D02*
X15082170Y16015460D01*
X15053441Y16003560D01*
X15028770Y15984630D01*
X15009840Y15959959D01*
X15002699Y15942722D01*
X14969299D01*
X14962160Y15959959D01*
X14943230Y15984630D01*
X14918559Y16003560D01*
X14889830Y16015460D01*
X14859000Y16019519D01*
X14828169Y16015460D01*
X14799442Y16003560D01*
X14774770Y15984630D01*
X14755840Y15959959D01*
X14754100Y15955759D01*
X14723100Y15961925D01*
Y16018500D01*
X14486900D01*
Y15782300D01*
X14723100D01*
Y15838875D01*
X14754100Y15845041D01*
X14755840Y15840842D01*
X14774770Y15816170D01*
X14799442Y15797240D01*
X14828169Y15785339D01*
X14859000Y15781281D01*
X14889830Y15785339D01*
X14918559Y15797240D01*
X14943230Y15816170D01*
X14962160Y15840842D01*
X14969299Y15858078D01*
X15002699D01*
X15009840Y15840842D01*
X15028770Y15816170D01*
X15053441Y15797240D01*
X15082170Y15785339D01*
X15113000Y15781281D01*
X15143829Y15785339D01*
X15172559Y15797240D01*
X15197231Y15816170D01*
X15216161Y15840842D01*
X15228059Y15869569D01*
X15232120Y15900400D01*
X15228059Y15931230D01*
X15216161Y15959959D01*
X15197231Y15984630D01*
X15172559Y16003560D01*
X15143829Y16015460D01*
X15113000Y16019519D01*
D02*
G37*
G36*
X17399001Y16034648D02*
X17364255Y16030074D01*
X17331876Y16016663D01*
X17304073Y15995328D01*
X17282738Y15967525D01*
X17269325Y15935146D01*
X17264752Y15900400D01*
X17269325Y15865654D01*
X17282738Y15833276D01*
X17304073Y15805472D01*
X17331876Y15784138D01*
X17364255Y15770726D01*
X17399001Y15766151D01*
X17433746Y15770726D01*
X17466124Y15784138D01*
X17493929Y15805472D01*
X17515262Y15833276D01*
X17528674Y15865654D01*
X17533247Y15900400D01*
X17528674Y15935146D01*
X17515262Y15967525D01*
X17493929Y15995328D01*
X17466124Y16016663D01*
X17433746Y16030074D01*
X17399001Y16034648D01*
D02*
G37*
G36*
X15621001Y15638519D02*
X15590170Y15634460D01*
X15561441Y15622560D01*
X15536771Y15603630D01*
X15517841Y15578960D01*
X15505940Y15550230D01*
X15501881Y15519400D01*
X15505940Y15488570D01*
X15517841Y15459840D01*
X15536771Y15435170D01*
X15561441Y15416240D01*
X15590170Y15404340D01*
X15621001Y15400281D01*
X15651830Y15404340D01*
X15680559Y15416240D01*
X15705231Y15435170D01*
X15724159Y15459840D01*
X15736060Y15488570D01*
X15740118Y15519400D01*
X15736060Y15550230D01*
X15724159Y15578960D01*
X15705231Y15603630D01*
X15680559Y15622560D01*
X15651830Y15634460D01*
X15621001Y15638519D01*
D02*
G37*
G36*
X14605000D02*
X14574170Y15634460D01*
X14545441Y15622560D01*
X14520770Y15603630D01*
X14501840Y15578960D01*
X14489940Y15550230D01*
X14485881Y15519400D01*
X14489940Y15488570D01*
X14501840Y15459840D01*
X14520770Y15435170D01*
X14545441Y15416240D01*
X14574170Y15404340D01*
X14605000Y15400281D01*
X14635831Y15404340D01*
X14664558Y15416240D01*
X14689230Y15435170D01*
X14708160Y15459840D01*
X14720061Y15488570D01*
X14724120Y15519400D01*
X14720061Y15550230D01*
X14708160Y15578960D01*
X14689230Y15603630D01*
X14664558Y15622560D01*
X14635831Y15634460D01*
X14605000Y15638519D01*
D02*
G37*
G36*
X16510001Y14724120D02*
X16479170Y14720061D01*
X16450441Y14708160D01*
X16425771Y14689230D01*
X16406841Y14664558D01*
X16394940Y14635831D01*
X16390881Y14605000D01*
X16394940Y14574170D01*
X16406841Y14545441D01*
X16425771Y14520770D01*
X16450441Y14501840D01*
X16479170Y14489940D01*
X16510001Y14485881D01*
X16540829Y14489940D01*
X16569559Y14501840D01*
X16594231Y14520770D01*
X16613161Y14545441D01*
X16625060Y14574170D01*
X16629118Y14605000D01*
X16625060Y14635831D01*
X16613161Y14664558D01*
X16594231Y14689230D01*
X16569559Y14708160D01*
X16540829Y14720061D01*
X16510001Y14724120D01*
D02*
G37*
G36*
X17017999Y16268475D02*
X16988475Y16264589D01*
X16960962Y16253192D01*
X16937337Y16235065D01*
X16919208Y16211438D01*
X16911496Y16192819D01*
X16716937Y15998260D01*
X16700652Y15977037D01*
X16690414Y15952322D01*
X16686922Y15925800D01*
X16686923Y15925797D01*
Y13487399D01*
X16686923Y10947400D01*
X16686923Y8763002D01*
X16686923Y8763000D01*
X16686923Y8762998D01*
Y8509002D01*
X16686923Y8509000D01*
X16690414Y8482477D01*
X16700652Y8457762D01*
X16716937Y8436538D01*
X17021738Y8131739D01*
X17021738Y8131738D01*
X17042963Y8115452D01*
X17067677Y8105215D01*
X17094200Y8101723D01*
X19809581D01*
X19809583Y8101723D01*
X19836105Y8105215D01*
X19860822Y8115452D01*
X19882045Y8131738D01*
X20880714Y9130406D01*
X20910278Y9134299D01*
X20943874Y9148214D01*
X20972722Y9170350D01*
X20994858Y9199199D01*
X21008772Y9232793D01*
X21013519Y9268844D01*
X21008772Y9304896D01*
X20994858Y9338490D01*
X20972722Y9367338D01*
X20943874Y9389474D01*
X20910278Y9403390D01*
X20874226Y9408136D01*
X20838176Y9403390D01*
X20804581Y9389474D01*
X20775732Y9367338D01*
X20753596Y9338490D01*
X20739682Y9304896D01*
X20735789Y9275330D01*
X19767136Y8306677D01*
X17136647D01*
X16891878Y8551447D01*
Y8660523D01*
X16969856D01*
X16988475Y8652811D01*
X17017999Y8648924D01*
X17047525Y8652811D01*
X17075038Y8664207D01*
X17098663Y8682336D01*
X17116792Y8705962D01*
X17128189Y8733475D01*
X17132076Y8763000D01*
X17128189Y8792525D01*
X17116792Y8820038D01*
X17098663Y8843664D01*
X17075038Y8861792D01*
X17047525Y8873189D01*
X17017999Y8877075D01*
X16988475Y8873189D01*
X16969856Y8865477D01*
X16891878D01*
Y9200790D01*
X16904527Y9206887D01*
X16922878Y9209181D01*
X16937337Y9190336D01*
X16960962Y9172208D01*
X16988475Y9160811D01*
X17017999Y9156925D01*
X17047525Y9160811D01*
X17075038Y9172208D01*
X17098663Y9190336D01*
X17116792Y9213962D01*
X17128189Y9241475D01*
X17132076Y9271000D01*
X17128189Y9300525D01*
X17116792Y9328038D01*
X17098663Y9351664D01*
X17075038Y9369793D01*
X17047525Y9381189D01*
X17017999Y9385076D01*
X16988475Y9381189D01*
X16960962Y9369793D01*
X16937337Y9351664D01*
X16922878Y9332820D01*
X16904527Y9335114D01*
X16891878Y9341211D01*
X16891878Y10947400D01*
Y10952053D01*
X17003639Y11063815D01*
X17017999Y11061924D01*
X17047525Y11065811D01*
X17075038Y11077207D01*
X17098663Y11095336D01*
X17116792Y11118962D01*
X17128189Y11146475D01*
X17132076Y11176000D01*
X17128189Y11205525D01*
X17116792Y11233038D01*
X17098663Y11256664D01*
X17075038Y11274792D01*
X17047525Y11286189D01*
X17017999Y11290075D01*
X16988475Y11286189D01*
X16960962Y11274792D01*
X16937337Y11256664D01*
X16922876Y11237819D01*
X16904529Y11240112D01*
X16891878Y11246210D01*
Y11613790D01*
X16904529Y11619888D01*
X16922876Y11622181D01*
X16937337Y11603336D01*
X16960962Y11585208D01*
X16988475Y11573811D01*
X17017999Y11569925D01*
X17047525Y11573811D01*
X17075038Y11585208D01*
X17098663Y11603336D01*
X17116792Y11626962D01*
X17128189Y11654475D01*
X17132076Y11684000D01*
X17128189Y11713525D01*
X17116792Y11741038D01*
X17098663Y11764664D01*
X17075038Y11782793D01*
X17047525Y11794189D01*
X17017999Y11798076D01*
X16988475Y11794189D01*
X16960962Y11782793D01*
X16937337Y11764664D01*
X16922876Y11745820D01*
X16904529Y11748113D01*
X16891878Y11754210D01*
X16891876Y13487399D01*
Y13492053D01*
X17003638Y13603815D01*
X17017999Y13601924D01*
X17047525Y13605811D01*
X17075038Y13617207D01*
X17098663Y13635336D01*
X17116792Y13658961D01*
X17128189Y13686475D01*
X17132076Y13716000D01*
X17128189Y13745525D01*
X17116792Y13773038D01*
X17098663Y13796664D01*
X17075038Y13814792D01*
X17047525Y13826189D01*
X17017999Y13830075D01*
X16988475Y13826189D01*
X16960962Y13814792D01*
X16937337Y13796664D01*
X16922876Y13777818D01*
X16904530Y13780112D01*
X16891876Y13786211D01*
Y14153790D01*
X16904530Y14159888D01*
X16922876Y14162181D01*
X16937337Y14143336D01*
X16960962Y14125208D01*
X16988475Y14113811D01*
X17017999Y14109924D01*
X17047525Y14113811D01*
X17075038Y14125208D01*
X17098663Y14143336D01*
X17116792Y14166962D01*
X17128189Y14194475D01*
X17132076Y14224001D01*
X17128189Y14253525D01*
X17116792Y14281038D01*
X17098663Y14304665D01*
X17075038Y14322794D01*
X17047525Y14334189D01*
X17017999Y14338075D01*
X16988475Y14334189D01*
X16960962Y14322794D01*
X16937337Y14304665D01*
X16922876Y14285818D01*
X16904530Y14288112D01*
X16891876Y14294209D01*
Y15883353D01*
X17056419Y16047894D01*
X17075038Y16055608D01*
X17098663Y16073737D01*
X17116792Y16097362D01*
X17128189Y16124875D01*
X17132076Y16154401D01*
X17128189Y16183925D01*
X17116792Y16211438D01*
X17098663Y16235065D01*
X17075038Y16253192D01*
X17047525Y16264589D01*
X17017999Y16268475D01*
D02*
G37*
G36*
X16510001Y14338075D02*
X16480475Y14334189D01*
X16452962Y14322794D01*
X16429337Y14304665D01*
X16411208Y14281038D01*
X16399811Y14253525D01*
X16395924Y14224001D01*
X16399811Y14194475D01*
X16411208Y14166963D01*
X16429337Y14143336D01*
X16452962Y14125208D01*
X16480475Y14113811D01*
X16510001Y14109924D01*
X16539525Y14113811D01*
X16567038Y14125208D01*
X16590665Y14143336D01*
X16608794Y14166963D01*
X16620189Y14194475D01*
X16624075Y14224001D01*
X16620189Y14253525D01*
X16608794Y14281038D01*
X16590665Y14304665D01*
X16567038Y14322794D01*
X16539525Y14334189D01*
X16510001Y14338075D01*
D02*
G37*
G36*
Y13830075D02*
X16480475Y13826189D01*
X16452962Y13814792D01*
X16429337Y13796664D01*
X16411208Y13773038D01*
X16399811Y13745525D01*
X16395924Y13716000D01*
X16399811Y13686475D01*
X16411208Y13658961D01*
X16429337Y13635336D01*
X16452962Y13617207D01*
X16480475Y13605811D01*
X16510001Y13601924D01*
X16539525Y13605811D01*
X16567038Y13617207D01*
X16590665Y13635336D01*
X16608794Y13658961D01*
X16620189Y13686475D01*
X16624075Y13716000D01*
X16620189Y13745525D01*
X16608794Y13773038D01*
X16590665Y13796664D01*
X16567038Y13814792D01*
X16539525Y13826189D01*
X16510001Y13830075D01*
D02*
G37*
G36*
X16002000D02*
X15972475Y13826189D01*
X15944962Y13814792D01*
X15921336Y13796664D01*
X15903207Y13773038D01*
X15891811Y13745525D01*
X15887924Y13716000D01*
X15891811Y13686475D01*
X15903207Y13658961D01*
X15921336Y13635336D01*
X15944962Y13617207D01*
X15972475Y13605811D01*
X16002000Y13601924D01*
X16031525Y13605811D01*
X16059038Y13617207D01*
X16082664Y13635336D01*
X16100792Y13658961D01*
X16112189Y13686475D01*
X16116075Y13716000D01*
X16112189Y13745525D01*
X16100792Y13773038D01*
X16082664Y13796664D01*
X16059038Y13814792D01*
X16031525Y13826189D01*
X16002000Y13830075D01*
D02*
G37*
G36*
X15113000Y13581119D02*
X15082170Y13577060D01*
X15053441Y13565160D01*
X15028770Y13546230D01*
X15009840Y13521559D01*
X15002699Y13504321D01*
X14969299D01*
X14962160Y13521559D01*
X14943230Y13546230D01*
X14918559Y13565160D01*
X14889830Y13577060D01*
X14859000Y13581119D01*
X14828169Y13577060D01*
X14799442Y13565160D01*
X14774770Y13546230D01*
X14755840Y13521559D01*
X14754100Y13517358D01*
X14723100Y13523524D01*
Y13580099D01*
X14486900D01*
Y13343900D01*
X14723100D01*
Y13400475D01*
X14754100Y13406641D01*
X14755840Y13402441D01*
X14774770Y13377769D01*
X14799442Y13358839D01*
X14828169Y13346941D01*
X14859000Y13342880D01*
X14889830Y13346941D01*
X14918559Y13358839D01*
X14943230Y13377769D01*
X14962160Y13402441D01*
X14969299Y13419678D01*
X15002699D01*
X15009840Y13402441D01*
X15028770Y13377769D01*
X15053441Y13358839D01*
X15082170Y13346941D01*
X15113000Y13342880D01*
X15143829Y13346941D01*
X15172559Y13358839D01*
X15197231Y13377769D01*
X15216161Y13402441D01*
X15228059Y13431171D01*
X15232120Y13462000D01*
X15228059Y13492830D01*
X15216161Y13521559D01*
X15197231Y13546230D01*
X15172559Y13565160D01*
X15143829Y13577060D01*
X15113000Y13581119D01*
D02*
G37*
G36*
X17399001Y13596248D02*
X17364255Y13591673D01*
X17331876Y13578262D01*
X17304073Y13556927D01*
X17282738Y13529124D01*
X17269325Y13496745D01*
X17264752Y13462000D01*
X17269325Y13427254D01*
X17282738Y13394876D01*
X17304073Y13367072D01*
X17331876Y13345738D01*
X17364255Y13332326D01*
X17399001Y13327753D01*
X17433746Y13332326D01*
X17466124Y13345738D01*
X17493929Y13367072D01*
X17515262Y13394876D01*
X17528674Y13427254D01*
X17533247Y13462000D01*
X17528674Y13496745D01*
X17515262Y13529124D01*
X17493929Y13556927D01*
X17466124Y13578262D01*
X17433746Y13591673D01*
X17399001Y13596248D01*
D02*
G37*
G36*
X13284200Y13047719D02*
X13253371Y13043660D01*
X13224641Y13031760D01*
X13199969Y13012830D01*
X13181039Y12988159D01*
X13173900Y12970921D01*
X13140500D01*
X13133360Y12988159D01*
X13114430Y13012830D01*
X13089758Y13031760D01*
X13061031Y13043660D01*
X13030200Y13047719D01*
X12999370Y13043660D01*
X12970641Y13031760D01*
X12945970Y13012830D01*
X12927040Y12988159D01*
X12915140Y12959430D01*
X12911081Y12928600D01*
X12915140Y12897771D01*
X12927040Y12869041D01*
X12945970Y12844371D01*
X12940369Y12809593D01*
X11629948Y11499172D01*
X10128784D01*
X10117230Y11514230D01*
X10092559Y11533160D01*
X10063830Y11545060D01*
X10033000Y11549119D01*
X10002170Y11545060D01*
X9973441Y11533160D01*
X9948770Y11514230D01*
X9929840Y11489559D01*
X9917940Y11460830D01*
X9913881Y11430000D01*
X9917940Y11399170D01*
X9929840Y11370441D01*
X9948770Y11345770D01*
X9973441Y11326840D01*
X10002170Y11314940D01*
X10033000Y11310881D01*
X10063830Y11314940D01*
X10092559Y11326840D01*
X10117230Y11345770D01*
X10128784Y11360828D01*
X10355564D01*
X10368404Y11329828D01*
X10077218Y11038641D01*
X10058400Y11041119D01*
X10027570Y11037060D01*
X9998841Y11025160D01*
X9974170Y11006230D01*
X9955240Y10981559D01*
X9943340Y10952830D01*
X9939281Y10922000D01*
X9943340Y10891170D01*
X9955240Y10862441D01*
X9974170Y10837770D01*
X9998841Y10818840D01*
X10027570Y10806940D01*
X10058400Y10802881D01*
X10089230Y10806940D01*
X10117959Y10818840D01*
X10142630Y10837770D01*
X10161560Y10862441D01*
X10173460Y10891170D01*
X10177519Y10922000D01*
X10175041Y10940818D01*
X10468052Y11233828D01*
X10736564D01*
X10749404Y11202828D01*
X10077218Y10530641D01*
X10058400Y10533119D01*
X10027570Y10529060D01*
X9998841Y10517160D01*
X9974170Y10498230D01*
X9955240Y10473559D01*
X9943340Y10444830D01*
X9939281Y10414000D01*
X9943340Y10383170D01*
X9955240Y10354441D01*
X9974170Y10329770D01*
X9998841Y10310840D01*
X10027570Y10298940D01*
X10058400Y10294881D01*
X10089230Y10298940D01*
X10117959Y10310840D01*
X10142630Y10329770D01*
X10161560Y10354441D01*
X10173460Y10383170D01*
X10177519Y10414000D01*
X10175041Y10432818D01*
X10849052Y11106828D01*
X11706331D01*
X11724234Y11109185D01*
X11740917Y11116095D01*
X11755243Y11127088D01*
X12408083Y11779928D01*
X14439900D01*
X14457803Y11782285D01*
X14474486Y11789195D01*
X14488812Y11800188D01*
X14684451Y11995828D01*
X15017216D01*
X15028770Y11980770D01*
X15053439Y11961840D01*
X15046956Y11930972D01*
X15036800D01*
X15018896Y11928615D01*
X15002214Y11921705D01*
X14987888Y11910712D01*
X14877818Y11800641D01*
X14859000Y11803119D01*
X14828169Y11799060D01*
X14799442Y11787160D01*
X14774770Y11768230D01*
X14755840Y11743559D01*
X14748700Y11726322D01*
X14715300D01*
X14708160Y11743559D01*
X14689230Y11768230D01*
X14664558Y11787160D01*
X14635831Y11799060D01*
X14605000Y11803119D01*
X14574170Y11799060D01*
X14545441Y11787160D01*
X14520770Y11768230D01*
X14501840Y11743559D01*
X14489940Y11714830D01*
X14485881Y11684000D01*
X14489940Y11653170D01*
X14501840Y11624441D01*
X14520770Y11599770D01*
X14545441Y11580840D01*
X14574170Y11568940D01*
X14605000Y11564881D01*
X14635831Y11568940D01*
X14664558Y11580840D01*
X14689230Y11599770D01*
X14708160Y11624441D01*
X14715300Y11641678D01*
X14748700D01*
X14755840Y11624441D01*
X14774770Y11599770D01*
X14799442Y11580840D01*
X14828169Y11568940D01*
X14859000Y11564881D01*
X14889830Y11568940D01*
X14918559Y11580840D01*
X14943230Y11599770D01*
X14962160Y11624441D01*
X14969299Y11641678D01*
X15002699D01*
X15009840Y11624441D01*
X15028770Y11599770D01*
X15053441Y11580840D01*
X15082170Y11568940D01*
X15113000Y11564881D01*
X15143829Y11568940D01*
X15172559Y11580840D01*
X15197231Y11599770D01*
X15216161Y11624441D01*
X15228059Y11653170D01*
X15232120Y11684000D01*
X15228059Y11714830D01*
X15216161Y11743559D01*
X15202295Y11761628D01*
X15209465Y11783955D01*
X15216214Y11792628D01*
X15795547D01*
X15889815Y11698362D01*
X15887924Y11684000D01*
X15891811Y11654475D01*
X15903207Y11626962D01*
X15921336Y11603336D01*
X15944962Y11585208D01*
X15972475Y11573811D01*
X16002000Y11569925D01*
X16031525Y11573811D01*
X16059038Y11585208D01*
X16082664Y11603336D01*
X16100792Y11626962D01*
X16112189Y11654475D01*
X16116075Y11684000D01*
X16112189Y11713525D01*
X16100792Y11741038D01*
X16082664Y11764664D01*
X16059038Y11782793D01*
X16031525Y11794189D01*
X16002000Y11798076D01*
X15987637Y11796185D01*
X15873112Y11910712D01*
X15858786Y11921705D01*
X15842104Y11928615D01*
X15824200Y11930972D01*
X15560043D01*
X15553560Y11961840D01*
X15578230Y11980770D01*
X15597160Y12005441D01*
X15609061Y12034170D01*
X15613120Y12065000D01*
X15609061Y12095830D01*
X15597160Y12124559D01*
X15578230Y12149230D01*
X15553558Y12168160D01*
X15524831Y12180060D01*
X15494000Y12184119D01*
X15463170Y12180060D01*
X15434441Y12168160D01*
X15409770Y12149230D01*
X15390840Y12124559D01*
X15378940Y12095830D01*
X15374881Y12065000D01*
X15378940Y12034170D01*
X15390840Y12005441D01*
X15409770Y11980770D01*
X15434441Y11961840D01*
X15427956Y11930972D01*
X15179044D01*
X15172560Y11961840D01*
X15197231Y11980770D01*
X15216161Y12005441D01*
X15228059Y12034170D01*
X15232120Y12065000D01*
X15228059Y12095830D01*
X15216161Y12124559D01*
X15197231Y12149230D01*
X15172559Y12168160D01*
X15143829Y12180060D01*
X15113000Y12184119D01*
X15082170Y12180060D01*
X15053441Y12168160D01*
X15028770Y12149230D01*
X15017216Y12134172D01*
X14655800D01*
X14637897Y12131815D01*
X14621214Y12124905D01*
X14606888Y12113912D01*
X14411247Y11918272D01*
X12437599D01*
X12425736Y11946912D01*
X13288927Y12810103D01*
X13315030Y12813541D01*
X13343759Y12825439D01*
X13368430Y12844370D01*
X13387360Y12869041D01*
X13399260Y12897771D01*
X13403319Y12928600D01*
X13399260Y12959430D01*
X13387360Y12988159D01*
X13368430Y13012830D01*
X13343759Y13031760D01*
X13315030Y13043660D01*
X13284200Y13047719D01*
D02*
G37*
G36*
X15621001Y13200119D02*
X15590170Y13196060D01*
X15561441Y13184160D01*
X15536771Y13165230D01*
X15517841Y13140559D01*
X15505940Y13111830D01*
X15501881Y13081000D01*
X15505940Y13050169D01*
X15517841Y13021442D01*
X15536771Y12996770D01*
X15561441Y12977840D01*
X15590170Y12965939D01*
X15621001Y12961880D01*
X15651830Y12965939D01*
X15680559Y12977840D01*
X15705231Y12996770D01*
X15724159Y13021442D01*
X15736060Y13050169D01*
X15740118Y13081000D01*
X15736060Y13111830D01*
X15724159Y13140559D01*
X15705231Y13165230D01*
X15680559Y13184160D01*
X15651830Y13196060D01*
X15621001Y13200119D01*
D02*
G37*
G36*
X14605000D02*
X14574170Y13196060D01*
X14545441Y13184160D01*
X14520770Y13165230D01*
X14501840Y13140559D01*
X14489940Y13111830D01*
X14485881Y13081000D01*
X14489940Y13050169D01*
X14501840Y13021442D01*
X14520770Y12996770D01*
X14545441Y12977840D01*
X14574170Y12965939D01*
X14605000Y12961880D01*
X14635831Y12965939D01*
X14664558Y12977840D01*
X14689230Y12996770D01*
X14708160Y13021442D01*
X14720061Y13050169D01*
X14724120Y13081000D01*
X14720061Y13111830D01*
X14708160Y13140559D01*
X14689230Y13165230D01*
X14664558Y13184160D01*
X14635831Y13196060D01*
X14605000Y13200119D01*
D02*
G37*
G36*
X16510001Y12184119D02*
X16479170Y12180060D01*
X16450441Y12168160D01*
X16425771Y12149230D01*
X16406841Y12124559D01*
X16394940Y12095830D01*
X16390881Y12065000D01*
X16394940Y12034170D01*
X16406841Y12005441D01*
X16425771Y11980770D01*
X16450441Y11961840D01*
X16479170Y11949940D01*
X16510001Y11945881D01*
X16540829Y11949940D01*
X16569559Y11961840D01*
X16594231Y11980770D01*
X16613161Y12005441D01*
X16625060Y12034170D01*
X16629118Y12065000D01*
X16625060Y12095830D01*
X16613161Y12124559D01*
X16594231Y12149230D01*
X16569559Y12168160D01*
X16540829Y12180060D01*
X16510001Y12184119D01*
D02*
G37*
G36*
Y11798076D02*
X16480475Y11794189D01*
X16452962Y11782793D01*
X16429337Y11764664D01*
X16411208Y11741038D01*
X16399811Y11713525D01*
X16395924Y11684000D01*
X16399811Y11654475D01*
X16411208Y11626963D01*
X16429337Y11603336D01*
X16452962Y11585208D01*
X16480475Y11573811D01*
X16510001Y11569925D01*
X16539525Y11573811D01*
X16567038Y11585208D01*
X16590665Y11603336D01*
X16608794Y11626963D01*
X16620189Y11654475D01*
X16624075Y11684000D01*
X16620189Y11713525D01*
X16608794Y11741038D01*
X16590665Y11764664D01*
X16567038Y11782793D01*
X16539525Y11794189D01*
X16510001Y11798076D01*
D02*
G37*
G36*
X8382000Y11544076D02*
X8352475Y11540189D01*
X8324962Y11528793D01*
X8301336Y11510664D01*
X8283208Y11487038D01*
X8271811Y11459525D01*
X8267925Y11430000D01*
X8271811Y11400475D01*
X8283208Y11372962D01*
X8301336Y11349336D01*
X8324962Y11331207D01*
X8352475Y11319811D01*
X8382000Y11315924D01*
X8411525Y11319811D01*
X8439038Y11331207D01*
X8462664Y11349336D01*
X8480793Y11372962D01*
X8492189Y11400475D01*
X8496076Y11430000D01*
X8492189Y11459525D01*
X8480793Y11487038D01*
X8462664Y11510664D01*
X8439038Y11528793D01*
X8411525Y11540189D01*
X8382000Y11544076D01*
D02*
G37*
G36*
X9017000Y11549119D02*
X8986170Y11545060D01*
X8957441Y11533160D01*
X8932770Y11514230D01*
X8913840Y11489559D01*
X8901940Y11460830D01*
X8897881Y11430000D01*
X8901940Y11399170D01*
X8913840Y11370441D01*
X8932770Y11345770D01*
X8957441Y11326840D01*
X8986170Y11314940D01*
X9017000Y11310881D01*
X9047830Y11314940D01*
X9076559Y11326840D01*
X9101230Y11345770D01*
X9120160Y11370441D01*
X9132060Y11399170D01*
X9136119Y11430000D01*
X9132060Y11460830D01*
X9120160Y11489559D01*
X9101230Y11514230D01*
X9076559Y11533160D01*
X9047830Y11545060D01*
X9017000Y11549119D01*
D02*
G37*
G36*
X16510001Y11290075D02*
X16480475Y11286189D01*
X16452962Y11274792D01*
X16429337Y11256664D01*
X16411208Y11233037D01*
X16399811Y11205525D01*
X16395924Y11176000D01*
X16399811Y11146475D01*
X16411208Y11118962D01*
X16429337Y11095336D01*
X16452962Y11077207D01*
X16480475Y11065811D01*
X16510001Y11061924D01*
X16539525Y11065811D01*
X16567038Y11077207D01*
X16590665Y11095336D01*
X16608794Y11118962D01*
X16620189Y11146475D01*
X16624075Y11176000D01*
X16620189Y11205525D01*
X16608794Y11233037D01*
X16590665Y11256664D01*
X16567038Y11274792D01*
X16539525Y11286189D01*
X16510001Y11290075D01*
D02*
G37*
G36*
X16002000D02*
X15972475Y11286189D01*
X15944962Y11274792D01*
X15921336Y11256664D01*
X15903207Y11233038D01*
X15891811Y11205525D01*
X15887924Y11176000D01*
X15891811Y11146475D01*
X15903207Y11118962D01*
X15921336Y11095336D01*
X15944962Y11077207D01*
X15972475Y11065811D01*
X16002000Y11061924D01*
X16031525Y11065811D01*
X16059038Y11077207D01*
X16082664Y11095336D01*
X16100792Y11118962D01*
X16112189Y11146475D01*
X16116075Y11176000D01*
X16112189Y11205525D01*
X16100792Y11233038D01*
X16082664Y11256664D01*
X16059038Y11274792D01*
X16031525Y11286189D01*
X16002000Y11290075D01*
D02*
G37*
G36*
X15113000Y11041119D02*
X15082170Y11037060D01*
X15053441Y11025160D01*
X15028770Y11006230D01*
X15009840Y10981559D01*
X15002699Y10964322D01*
X14969299D01*
X14962160Y10981559D01*
X14943230Y11006230D01*
X14918559Y11025160D01*
X14889830Y11037060D01*
X14859000Y11041119D01*
X14828169Y11037060D01*
X14799442Y11025160D01*
X14774770Y11006230D01*
X14755840Y10981559D01*
X14754100Y10977359D01*
X14723100Y10983525D01*
Y11040100D01*
X14486900D01*
Y10803900D01*
X14723100D01*
Y10860475D01*
X14754100Y10866641D01*
X14755840Y10862441D01*
X14774770Y10837770D01*
X14799442Y10818840D01*
X14828169Y10806940D01*
X14859000Y10802881D01*
X14889830Y10806940D01*
X14918559Y10818840D01*
X14943230Y10837770D01*
X14962160Y10862441D01*
X14969299Y10879678D01*
X15002699D01*
X15009840Y10862441D01*
X15028770Y10837770D01*
X15053441Y10818840D01*
X15082170Y10806940D01*
X15113000Y10802881D01*
X15143829Y10806940D01*
X15172559Y10818840D01*
X15197231Y10837770D01*
X15216161Y10862441D01*
X15228059Y10891170D01*
X15232120Y10922000D01*
X15228059Y10952830D01*
X15216161Y10981559D01*
X15197231Y11006230D01*
X15172559Y11025160D01*
X15143829Y11037060D01*
X15113000Y11041119D01*
D02*
G37*
G36*
X8382000Y11036076D02*
X8352475Y11032189D01*
X8324962Y11020793D01*
X8301336Y11002664D01*
X8283208Y10979038D01*
X8271811Y10951525D01*
X8267925Y10922000D01*
X8271811Y10892475D01*
X8283208Y10864962D01*
X8301336Y10841336D01*
X8324962Y10823207D01*
X8352475Y10811811D01*
X8382000Y10807924D01*
X8411525Y10811811D01*
X8439038Y10823207D01*
X8462664Y10841336D01*
X8480793Y10864962D01*
X8492189Y10892475D01*
X8496076Y10922000D01*
X8492189Y10951525D01*
X8480793Y10979038D01*
X8462664Y11002664D01*
X8439038Y11020793D01*
X8411525Y11032189D01*
X8382000Y11036076D01*
D02*
G37*
G36*
X9042400Y11041119D02*
X9011570Y11037060D01*
X8982841Y11025160D01*
X8958170Y11006230D01*
X8939240Y10981559D01*
X8927340Y10952830D01*
X8923281Y10922000D01*
X8927340Y10891170D01*
X8939240Y10862441D01*
X8958170Y10837770D01*
X8982841Y10818840D01*
X9011570Y10806940D01*
X9042400Y10802881D01*
X9073230Y10806940D01*
X9101959Y10818840D01*
X9126630Y10837770D01*
X9145560Y10862441D01*
X9157460Y10891170D01*
X9161519Y10922000D01*
X9157460Y10952830D01*
X9145560Y10981559D01*
X9126630Y11006230D01*
X9101959Y11025160D01*
X9073230Y11037060D01*
X9042400Y11041119D01*
D02*
G37*
G36*
X17399001Y11056248D02*
X17364255Y11051674D01*
X17331876Y11038262D01*
X17304073Y11016928D01*
X17282738Y10989124D01*
X17269325Y10956746D01*
X17264752Y10922000D01*
X17269325Y10887254D01*
X17282738Y10854876D01*
X17304073Y10827072D01*
X17331876Y10805738D01*
X17364255Y10792326D01*
X17399001Y10787752D01*
X17433746Y10792326D01*
X17466124Y10805738D01*
X17493929Y10827072D01*
X17515262Y10854876D01*
X17528674Y10887254D01*
X17533247Y10922000D01*
X17528674Y10956746D01*
X17515262Y10989124D01*
X17493929Y11016928D01*
X17466124Y11038262D01*
X17433746Y11051674D01*
X17399001Y11056248D01*
D02*
G37*
G36*
X15621001Y10660119D02*
X15590170Y10656060D01*
X15561441Y10644160D01*
X15536771Y10625230D01*
X15517841Y10600559D01*
X15505940Y10571830D01*
X15501881Y10541000D01*
X15505940Y10510170D01*
X15517841Y10481441D01*
X15536771Y10456770D01*
X15561441Y10437840D01*
X15590170Y10425940D01*
X15621001Y10421881D01*
X15651830Y10425940D01*
X15680559Y10437840D01*
X15705231Y10456770D01*
X15724159Y10481441D01*
X15736060Y10510170D01*
X15740118Y10541000D01*
X15736060Y10571830D01*
X15724159Y10600559D01*
X15705231Y10625230D01*
X15680559Y10644160D01*
X15651830Y10656060D01*
X15621001Y10660119D01*
D02*
G37*
G36*
X14605000D02*
X14574170Y10656060D01*
X14545441Y10644160D01*
X14520770Y10625230D01*
X14501840Y10600559D01*
X14489940Y10571830D01*
X14485881Y10541000D01*
X14489940Y10510170D01*
X14501840Y10481441D01*
X14520770Y10456770D01*
X14545441Y10437840D01*
X14574170Y10425940D01*
X14605000Y10421881D01*
X14635831Y10425940D01*
X14664558Y10437840D01*
X14689230Y10456770D01*
X14708160Y10481441D01*
X14720061Y10510170D01*
X14724120Y10541000D01*
X14720061Y10571830D01*
X14708160Y10600559D01*
X14689230Y10625230D01*
X14664558Y10644160D01*
X14635831Y10656060D01*
X14605000Y10660119D01*
D02*
G37*
G36*
X8382000Y10528076D02*
X8352475Y10524189D01*
X8324962Y10512793D01*
X8301336Y10494664D01*
X8283208Y10471038D01*
X8271811Y10443525D01*
X8267925Y10414000D01*
X8271811Y10384475D01*
X8283208Y10356962D01*
X8301336Y10333336D01*
X8324962Y10315207D01*
X8352475Y10303811D01*
X8382000Y10299924D01*
X8411525Y10303811D01*
X8439038Y10315207D01*
X8462664Y10333336D01*
X8480793Y10356962D01*
X8492189Y10384475D01*
X8496076Y10414000D01*
X8492189Y10443525D01*
X8480793Y10471038D01*
X8462664Y10494664D01*
X8439038Y10512793D01*
X8411525Y10524189D01*
X8382000Y10528076D01*
D02*
G37*
G36*
X9042400Y10533119D02*
X9011570Y10529060D01*
X8982841Y10517160D01*
X8958170Y10498230D01*
X8939240Y10473559D01*
X8927340Y10444830D01*
X8923281Y10414000D01*
X8927340Y10383170D01*
X8939240Y10354441D01*
X8958170Y10329770D01*
X8982841Y10310840D01*
X9011570Y10298940D01*
X9042400Y10294881D01*
X9073230Y10298940D01*
X9101959Y10310840D01*
X9126630Y10329770D01*
X9145560Y10354441D01*
X9157460Y10383170D01*
X9161519Y10414000D01*
X9157460Y10444830D01*
X9145560Y10473559D01*
X9126630Y10498230D01*
X9101959Y10517160D01*
X9073230Y10529060D01*
X9042400Y10533119D01*
D02*
G37*
G36*
X8382000Y10020076D02*
X8352475Y10016189D01*
X8324962Y10004793D01*
X8301336Y9986664D01*
X8283208Y9963038D01*
X8271811Y9935525D01*
X8267925Y9906000D01*
X8271811Y9876475D01*
X8283208Y9848962D01*
X8301336Y9825336D01*
X8324962Y9807207D01*
X8352475Y9795811D01*
X8382000Y9791924D01*
X8411525Y9795811D01*
X8439038Y9807207D01*
X8462664Y9825336D01*
X8480793Y9848962D01*
X8492189Y9876475D01*
X8496076Y9906000D01*
X8492189Y9935525D01*
X8480793Y9963038D01*
X8462664Y9986664D01*
X8439038Y10004793D01*
X8411525Y10016189D01*
X8382000Y10020076D01*
D02*
G37*
G36*
X9067800Y10025119D02*
X9036970Y10021060D01*
X9008241Y10009160D01*
X8983570Y9990230D01*
X8964640Y9965559D01*
X8952740Y9936830D01*
X8948681Y9906000D01*
X8952740Y9875170D01*
X8964640Y9846441D01*
X8983570Y9821770D01*
X9008241Y9802840D01*
X9036970Y9790940D01*
X9067800Y9786881D01*
X9098630Y9790940D01*
X9127359Y9802840D01*
X9152030Y9821770D01*
X9170960Y9846441D01*
X9182860Y9875170D01*
X9186919Y9906000D01*
X9182860Y9936830D01*
X9170960Y9965559D01*
X9152030Y9990230D01*
X9127359Y10009160D01*
X9098630Y10021060D01*
X9067800Y10025119D01*
D02*
G37*
G36*
X16510001Y9771119D02*
X16479170Y9767060D01*
X16450441Y9755160D01*
X16425771Y9736230D01*
X16406841Y9711559D01*
X16394940Y9682830D01*
X16390881Y9652000D01*
X16394940Y9621170D01*
X16406841Y9592441D01*
X16425771Y9567770D01*
X16450441Y9548840D01*
X16479170Y9536940D01*
X16510001Y9532881D01*
X16540829Y9536940D01*
X16569559Y9548840D01*
X16594231Y9567770D01*
X16613161Y9592441D01*
X16625060Y9621170D01*
X16629118Y9652000D01*
X16625060Y9682830D01*
X16613161Y9711559D01*
X16594231Y9736230D01*
X16569559Y9755160D01*
X16540829Y9767060D01*
X16510001Y9771119D01*
D02*
G37*
G36*
X10083800Y10025119D02*
X10052970Y10021060D01*
X10024241Y10009160D01*
X9999570Y9990230D01*
X9980640Y9965559D01*
X9968740Y9936830D01*
X9964681Y9906000D01*
X9968740Y9875170D01*
X9980640Y9846441D01*
X9999570Y9821770D01*
X10024241Y9802840D01*
X10052970Y9790940D01*
X10083800Y9786881D01*
X10114630Y9790940D01*
X10143359Y9802840D01*
X10168030Y9821770D01*
X10179584Y9836828D01*
X14830348D01*
X14996359Y9670818D01*
X14993881Y9652000D01*
X14997940Y9621170D01*
X15009840Y9592441D01*
X15028770Y9567770D01*
X15053439Y9548840D01*
X15046956Y9517972D01*
X15036800D01*
X15018896Y9515615D01*
X15002214Y9508705D01*
X14987888Y9497712D01*
X14877818Y9387641D01*
X14859000Y9390119D01*
X14828169Y9386060D01*
X14799442Y9374160D01*
X14774770Y9355230D01*
X14755840Y9330559D01*
X14748700Y9313322D01*
X14715300D01*
X14708160Y9330559D01*
X14689230Y9355230D01*
X14664558Y9374160D01*
X14635831Y9386060D01*
X14605000Y9390119D01*
X14574170Y9386060D01*
X14545441Y9374160D01*
X14520770Y9355230D01*
X14501840Y9330559D01*
X14489940Y9301830D01*
X14485881Y9271000D01*
X14489940Y9240170D01*
X14501840Y9211441D01*
X14520770Y9186770D01*
X14545441Y9167840D01*
X14574170Y9155940D01*
X14605000Y9151881D01*
X14635831Y9155940D01*
X14664558Y9167840D01*
X14689230Y9186770D01*
X14708160Y9211441D01*
X14715300Y9228678D01*
X14748700D01*
X14755840Y9211441D01*
X14774770Y9186770D01*
X14799442Y9167840D01*
X14828169Y9155940D01*
X14859000Y9151881D01*
X14889830Y9155940D01*
X14918559Y9167840D01*
X14943230Y9186770D01*
X14962160Y9211441D01*
X14969299Y9228678D01*
X15002699D01*
X15009840Y9211441D01*
X15028770Y9186770D01*
X15053441Y9167840D01*
X15082170Y9155940D01*
X15113000Y9151881D01*
X15143829Y9155940D01*
X15172559Y9167840D01*
X15197231Y9186770D01*
X15216161Y9211441D01*
X15228059Y9240170D01*
X15232120Y9271000D01*
X15228059Y9301830D01*
X15216161Y9330559D01*
X15202295Y9348628D01*
X15209465Y9370955D01*
X15216214Y9379628D01*
X15795547D01*
X15889815Y9285362D01*
X15887924Y9271000D01*
X15891811Y9241475D01*
X15903207Y9213962D01*
X15921336Y9190336D01*
X15944962Y9172208D01*
X15972475Y9160811D01*
X16002000Y9156925D01*
X16031525Y9160811D01*
X16059038Y9172208D01*
X16082664Y9190336D01*
X16100792Y9213962D01*
X16112189Y9241475D01*
X16116075Y9271000D01*
X16112189Y9300525D01*
X16100792Y9328038D01*
X16082664Y9351664D01*
X16059038Y9369793D01*
X16031525Y9381189D01*
X16002000Y9385076D01*
X15987637Y9383185D01*
X15873112Y9497712D01*
X15858786Y9508705D01*
X15842104Y9515615D01*
X15824200Y9517972D01*
X15560043D01*
X15553560Y9548840D01*
X15578230Y9567770D01*
X15597160Y9592441D01*
X15609061Y9621170D01*
X15613120Y9652000D01*
X15609061Y9682830D01*
X15597160Y9711559D01*
X15578230Y9736230D01*
X15553558Y9755160D01*
X15524831Y9767060D01*
X15494000Y9771119D01*
X15463170Y9767060D01*
X15434441Y9755160D01*
X15409770Y9736230D01*
X15390840Y9711559D01*
X15378940Y9682830D01*
X15374881Y9652000D01*
X15378940Y9621170D01*
X15390840Y9592441D01*
X15409770Y9567770D01*
X15434441Y9548840D01*
X15427956Y9517972D01*
X15179044D01*
X15172560Y9548840D01*
X15197231Y9567770D01*
X15216161Y9592441D01*
X15228059Y9621170D01*
X15232120Y9652000D01*
X15228059Y9682830D01*
X15216161Y9711559D01*
X15197231Y9736230D01*
X15172559Y9755160D01*
X15143829Y9767060D01*
X15113000Y9771119D01*
X15094182Y9768641D01*
X14907912Y9954912D01*
X14893587Y9965905D01*
X14876903Y9972815D01*
X14859000Y9975172D01*
X10179584D01*
X10168030Y9990230D01*
X10143359Y10009160D01*
X10114630Y10021060D01*
X10083800Y10025119D01*
D02*
G37*
G36*
X17399001Y17050648D02*
X17364255Y17046074D01*
X17331876Y17032661D01*
X17304073Y17011328D01*
X17282738Y16983524D01*
X17269325Y16951146D01*
X17264752Y16916400D01*
X17269325Y16881654D01*
X17282738Y16849277D01*
X17304073Y16821472D01*
X17331876Y16800137D01*
X17364255Y16786726D01*
X17386707Y16783771D01*
X17626723Y16543753D01*
Y15824207D01*
X17626723Y15824203D01*
X17630215Y15797681D01*
X17640453Y15772966D01*
X17656738Y15751743D01*
X17787479Y15621002D01*
X17656738Y15490262D01*
X17640453Y15469038D01*
X17630215Y15444324D01*
X17626723Y15417799D01*
X17626723Y15417798D01*
Y14803548D01*
X17431187Y14608011D01*
X17399001Y14612248D01*
X17364255Y14607674D01*
X17331876Y14594263D01*
X17304073Y14572928D01*
X17282738Y14545123D01*
X17269325Y14512746D01*
X17264752Y14478000D01*
X17269325Y14443254D01*
X17282738Y14410876D01*
X17304073Y14383072D01*
X17331876Y14361739D01*
X17364255Y14348326D01*
X17399001Y14343752D01*
X17433746Y14348326D01*
X17466124Y14361739D01*
X17493929Y14383072D01*
X17515262Y14410876D01*
X17528674Y14443254D01*
X17533247Y14478000D01*
X17529012Y14510187D01*
X17598083Y14579259D01*
X17626723Y14567397D01*
Y12263547D01*
X17431187Y12068011D01*
X17399001Y12072248D01*
X17364255Y12067674D01*
X17331876Y12054262D01*
X17304073Y12032928D01*
X17282738Y12005124D01*
X17269325Y11972746D01*
X17264752Y11938000D01*
X17269325Y11903254D01*
X17282738Y11870876D01*
X17304073Y11843072D01*
X17331876Y11821738D01*
X17364255Y11808326D01*
X17399001Y11803752D01*
X17433746Y11808326D01*
X17466124Y11821738D01*
X17493929Y11843072D01*
X17515262Y11870876D01*
X17528674Y11903254D01*
X17533247Y11938000D01*
X17529012Y11970187D01*
X17598083Y12039259D01*
X17626723Y12027396D01*
Y9897647D01*
X17386707Y9657630D01*
X17364255Y9654674D01*
X17331876Y9641262D01*
X17304073Y9619928D01*
X17282738Y9592124D01*
X17269325Y9559746D01*
X17264752Y9525000D01*
X17269325Y9490254D01*
X17282738Y9457876D01*
X17304073Y9430072D01*
X17331876Y9408738D01*
X17364255Y9395326D01*
X17399001Y9390752D01*
X17433746Y9395326D01*
X17466124Y9408738D01*
X17493929Y9430072D01*
X17515262Y9457876D01*
X17528674Y9490254D01*
X17531630Y9512706D01*
X17801662Y9782737D01*
X17801662Y9782738D01*
X17817947Y9803962D01*
X17828185Y9828677D01*
X17831677Y9855200D01*
X17831677Y9855202D01*
Y12242800D01*
Y14808200D01*
Y15375352D01*
X17974849Y15518526D01*
X22537337D01*
X22543918Y15513474D01*
X22550426Y15510779D01*
Y15477225D01*
X22543918Y15474530D01*
X22518204Y15454797D01*
X22498473Y15429083D01*
X22486069Y15399138D01*
X22481837Y15367001D01*
X22486069Y15334866D01*
X22498473Y15304921D01*
X22518204Y15279205D01*
X22543918Y15259474D01*
X22550426Y15256779D01*
Y15223225D01*
X22543918Y15220531D01*
X22518204Y15200798D01*
X22498473Y15175082D01*
X22486069Y15145139D01*
X22481837Y15113002D01*
X22486069Y15080865D01*
X22498473Y15050922D01*
X22518204Y15025206D01*
X22543918Y15005473D01*
X22550426Y15002779D01*
Y14969225D01*
X22543918Y14966530D01*
X22518204Y14946799D01*
X22498473Y14921083D01*
X22486069Y14891138D01*
X22481837Y14859003D01*
X22486069Y14826866D01*
X22498473Y14796921D01*
X22518204Y14771207D01*
X22543918Y14751474D01*
X22550426Y14748779D01*
Y14715225D01*
X22543918Y14712531D01*
X22518204Y14692798D01*
X22498473Y14667084D01*
X22486069Y14637138D01*
X22481837Y14605002D01*
X22486069Y14572865D01*
X22498473Y14542921D01*
X22518204Y14517206D01*
X22543918Y14497475D01*
X22550426Y14494778D01*
Y14461224D01*
X22543918Y14458530D01*
X22518204Y14438799D01*
X22498473Y14413083D01*
X22486069Y14383138D01*
X22481837Y14351003D01*
X22486069Y14318866D01*
X22498473Y14288921D01*
X22518204Y14263206D01*
X22543918Y14243474D01*
X22550426Y14240779D01*
Y14207225D01*
X22543918Y14204530D01*
X22518204Y14184798D01*
X22498473Y14159084D01*
X22486069Y14129138D01*
X22481837Y14097002D01*
X22486069Y14064867D01*
X22498473Y14034921D01*
X22518204Y14009206D01*
X22543918Y13989474D01*
X22550426Y13986778D01*
Y13953226D01*
X22543918Y13950529D01*
X22518204Y13930798D01*
X22498473Y13905083D01*
X22486069Y13875137D01*
X22481837Y13843002D01*
X22486069Y13810866D01*
X22498473Y13780920D01*
X22518204Y13755206D01*
X22543918Y13735474D01*
X22550426Y13732779D01*
Y13699225D01*
X22543918Y13696530D01*
X22518204Y13676797D01*
X22498473Y13651083D01*
X22486069Y13621138D01*
X22481837Y13589001D01*
X22486069Y13556866D01*
X22498473Y13526921D01*
X22518204Y13501205D01*
X22543918Y13481474D01*
X22550426Y13478780D01*
Y13445226D01*
X22543918Y13442529D01*
X22518204Y13422798D01*
X22498473Y13397083D01*
X22486069Y13367139D01*
X22481837Y13335002D01*
X22486069Y13302866D01*
X22498473Y13272922D01*
X22518204Y13247206D01*
X22543918Y13227473D01*
X22550426Y13224779D01*
Y13191225D01*
X22543918Y13188530D01*
X22518204Y13168797D01*
X22498473Y13143083D01*
X22486069Y13113138D01*
X22481837Y13081001D01*
X22486069Y13048866D01*
X22498473Y13018921D01*
X22518204Y12993205D01*
X22543918Y12973474D01*
X22550426Y12970779D01*
Y12937225D01*
X22543918Y12934531D01*
X22518204Y12914798D01*
X22498473Y12889082D01*
X22486069Y12859138D01*
X22481837Y12827002D01*
X22486069Y12794866D01*
X22498473Y12764921D01*
X22518204Y12739206D01*
X22543918Y12719474D01*
X22550426Y12716779D01*
Y12683225D01*
X22543918Y12680530D01*
X22518204Y12660798D01*
X22498473Y12635083D01*
X22486069Y12605138D01*
X22481837Y12573002D01*
X22486069Y12540866D01*
X22498473Y12510921D01*
X22518204Y12485206D01*
X22543918Y12465474D01*
X22550426Y12462779D01*
Y12429225D01*
X22543918Y12426530D01*
X22518204Y12406798D01*
X22498473Y12381083D01*
X22486069Y12351138D01*
X22481837Y12319002D01*
X22486069Y12286866D01*
X22498473Y12256921D01*
X22518204Y12231206D01*
X22543918Y12211474D01*
X22550426Y12208779D01*
Y12175225D01*
X22543918Y12172529D01*
X22518204Y12152798D01*
X22498473Y12127083D01*
X22486069Y12097137D01*
X22481837Y12065002D01*
X22486069Y12032866D01*
X22498473Y12002921D01*
X22518204Y11977206D01*
X22543918Y11957474D01*
X22550426Y11954779D01*
Y11921225D01*
X22543918Y11918529D01*
X22518204Y11898798D01*
X22498473Y11873083D01*
X22486069Y11843137D01*
X22481837Y11811002D01*
X22486069Y11778866D01*
X22498473Y11748921D01*
X22518204Y11723206D01*
X22543918Y11703474D01*
X22550426Y11700779D01*
Y11667225D01*
X22543918Y11664530D01*
X22518204Y11644798D01*
X22498473Y11619083D01*
X22486069Y11589138D01*
X22481837Y11557002D01*
X22486069Y11524866D01*
X22498473Y11494921D01*
X22518204Y11469206D01*
X22543918Y11449474D01*
X22550426Y11446779D01*
Y11413225D01*
X22543918Y11410530D01*
X22518204Y11390798D01*
X22498473Y11365083D01*
X22486069Y11335138D01*
X22481837Y11303002D01*
X22486069Y11270866D01*
X22498473Y11240921D01*
X22518204Y11215206D01*
X22543918Y11195474D01*
X22550426Y11192779D01*
Y11159225D01*
X22543918Y11156530D01*
X22518204Y11136798D01*
X22498473Y11111083D01*
X22486069Y11081138D01*
X22481837Y11049002D01*
X22486069Y11016866D01*
X22498473Y10986921D01*
X22518204Y10961206D01*
X22543918Y10941474D01*
X22550426Y10938779D01*
Y10905225D01*
X22543918Y10902530D01*
X22518204Y10882798D01*
X22498473Y10857083D01*
X22486069Y10827138D01*
X22481837Y10795002D01*
X22486069Y10762866D01*
X22498473Y10732921D01*
X22518204Y10707206D01*
X22543918Y10687474D01*
X22550426Y10684779D01*
Y10651225D01*
X22543918Y10648530D01*
X22518204Y10628798D01*
X22498473Y10603083D01*
X22486069Y10573138D01*
X22481837Y10541002D01*
X22486069Y10508866D01*
X22498473Y10478921D01*
X22518204Y10453206D01*
X22543918Y10433474D01*
X22550426Y10430779D01*
Y10397225D01*
X22543918Y10394530D01*
X22518204Y10374798D01*
X22498473Y10349083D01*
X22486069Y10319138D01*
X22481837Y10287002D01*
X22486069Y10254866D01*
X22498473Y10224921D01*
X22518204Y10199206D01*
X22543918Y10179474D01*
X22550426Y10176779D01*
Y10143225D01*
X22543918Y10140529D01*
X22518204Y10120798D01*
X22498473Y10095083D01*
X22486069Y10065137D01*
X22481837Y10033002D01*
X22486069Y10000866D01*
X22498473Y9970921D01*
X22518204Y9945206D01*
X22543918Y9925474D01*
X22550426Y9922779D01*
Y9889225D01*
X22543918Y9886529D01*
X22518204Y9866798D01*
X22498473Y9841083D01*
X22486069Y9811137D01*
X22481837Y9779002D01*
X22486069Y9746866D01*
X22498473Y9716921D01*
X22518204Y9691206D01*
X22543918Y9671474D01*
X22550426Y9668779D01*
Y9635225D01*
X22543918Y9632530D01*
X22518204Y9612798D01*
X22498473Y9587083D01*
X22486069Y9557138D01*
X22481837Y9525002D01*
X22486069Y9492866D01*
X22498473Y9462921D01*
X22518204Y9437206D01*
X22535362Y9424040D01*
X22538834Y9394688D01*
X22537064Y9386759D01*
X22522633Y9373479D01*
X21538283D01*
X21511819Y9393786D01*
X21478224Y9407701D01*
X21442172Y9412448D01*
X21406120Y9407701D01*
X21372527Y9393786D01*
X21343678Y9371650D01*
X21321542Y9342801D01*
X21307626Y9309207D01*
X21302881Y9273156D01*
X21307626Y9237104D01*
X21321542Y9203510D01*
X21343678Y9174662D01*
X21372527Y9152526D01*
X21406120Y9138610D01*
X21442172Y9133864D01*
X21478224Y9138610D01*
X21511819Y9152526D01*
X21532671Y9168525D01*
X22537337D01*
X22543918Y9163474D01*
X22550426Y9160779D01*
Y9127225D01*
X22543918Y9124530D01*
X22518204Y9104798D01*
X22498473Y9079083D01*
X22486069Y9049138D01*
X22481837Y9017002D01*
X22486069Y8984866D01*
X22498473Y8954921D01*
X22518204Y8929206D01*
X22543918Y8909474D01*
X22573865Y8897071D01*
X22606000Y8892840D01*
X22638135Y8897071D01*
X22668082Y8909474D01*
X22693794Y8929206D01*
X22713527Y8954921D01*
X22725931Y8984866D01*
X22730162Y9017002D01*
X22725931Y9049138D01*
X22713527Y9079083D01*
X22693794Y9104798D01*
X22676637Y9117964D01*
X22673166Y9147316D01*
X22674934Y9155245D01*
X22689365Y9168525D01*
X23045335D01*
X23051918Y9163474D01*
X23058424Y9160779D01*
Y9127225D01*
X23051918Y9124530D01*
X23026204Y9104798D01*
X23006471Y9079083D01*
X22994067Y9049138D01*
X22989838Y9017002D01*
X22994067Y8984866D01*
X23006471Y8954921D01*
X23026204Y8929206D01*
X23051918Y8909474D01*
X23081863Y8897071D01*
X23113998Y8892840D01*
X23146135Y8897071D01*
X23176080Y8909474D01*
X23201794Y8929206D01*
X23221527Y8954921D01*
X23233931Y8984866D01*
X23238162Y9017002D01*
X23233931Y9049138D01*
X23221527Y9079083D01*
X23201794Y9104798D01*
X23176080Y9124530D01*
X23169574Y9127225D01*
Y9160779D01*
X23176080Y9163474D01*
X23201794Y9183206D01*
X23221527Y9208921D01*
X23233931Y9238866D01*
X23238162Y9271002D01*
X23233931Y9303138D01*
X23221527Y9333083D01*
X23201794Y9358798D01*
X23176080Y9378530D01*
X23169574Y9381225D01*
Y9414779D01*
X23176080Y9417474D01*
X23201794Y9437206D01*
X23221527Y9462921D01*
X23233931Y9492866D01*
X23238162Y9525002D01*
X23233931Y9557138D01*
X23221527Y9587083D01*
X23201794Y9612798D01*
X23176080Y9632530D01*
X23169574Y9635225D01*
Y9668779D01*
X23176080Y9671474D01*
X23201794Y9691206D01*
X23221527Y9716921D01*
X23233931Y9746866D01*
X23238162Y9779002D01*
X23233931Y9811137D01*
X23221527Y9841083D01*
X23201794Y9866798D01*
X23176080Y9886529D01*
X23169574Y9889225D01*
Y9922779D01*
X23176080Y9925474D01*
X23201794Y9945206D01*
X23221527Y9970921D01*
X23233931Y10000866D01*
X23238162Y10033002D01*
X23233931Y10065137D01*
X23221527Y10095083D01*
X23201794Y10120798D01*
X23176080Y10140529D01*
X23169572Y10143225D01*
Y10176779D01*
X23176080Y10179474D01*
X23201794Y10199206D01*
X23221527Y10224921D01*
X23233931Y10254866D01*
X23238162Y10287002D01*
X23233931Y10319138D01*
X23221527Y10349083D01*
X23201794Y10374798D01*
X23176080Y10394530D01*
X23169574Y10397225D01*
Y10430779D01*
X23176080Y10433474D01*
X23201794Y10453206D01*
X23221527Y10478921D01*
X23233931Y10508866D01*
X23238162Y10541002D01*
X23233931Y10573138D01*
X23221527Y10603083D01*
X23201794Y10628798D01*
X23176080Y10648530D01*
X23169574Y10651225D01*
Y10684779D01*
X23176080Y10687474D01*
X23201794Y10707206D01*
X23221527Y10732921D01*
X23233931Y10762866D01*
X23238162Y10795002D01*
X23233931Y10827138D01*
X23221527Y10857083D01*
X23201794Y10882798D01*
X23176080Y10902530D01*
X23169574Y10905225D01*
Y10938779D01*
X23176080Y10941474D01*
X23201794Y10961206D01*
X23221527Y10986921D01*
X23233931Y11016866D01*
X23238162Y11049002D01*
X23233931Y11081138D01*
X23221527Y11111083D01*
X23201794Y11136798D01*
X23176080Y11156530D01*
X23169574Y11159225D01*
Y11192779D01*
X23176080Y11195474D01*
X23201794Y11215206D01*
X23221527Y11240921D01*
X23233931Y11270866D01*
X23238162Y11303002D01*
X23233931Y11335138D01*
X23221527Y11365083D01*
X23201794Y11390798D01*
X23176080Y11410530D01*
X23169574Y11413225D01*
Y11446779D01*
X23176080Y11449474D01*
X23201794Y11469206D01*
X23221527Y11494921D01*
X23233931Y11524866D01*
X23238162Y11557002D01*
X23233931Y11589138D01*
X23221527Y11619083D01*
X23201794Y11644798D01*
X23176080Y11664530D01*
X23169574Y11667225D01*
Y11700779D01*
X23176080Y11703474D01*
X23201794Y11723206D01*
X23221527Y11748921D01*
X23233931Y11778866D01*
X23238162Y11811002D01*
X23233931Y11843137D01*
X23221527Y11873083D01*
X23201794Y11898798D01*
X23176080Y11918529D01*
X23169574Y11921225D01*
Y11954779D01*
X23176080Y11957474D01*
X23201794Y11977206D01*
X23221527Y12002921D01*
X23233931Y12032866D01*
X23238162Y12065002D01*
X23233931Y12097137D01*
X23221527Y12127083D01*
X23201794Y12152798D01*
X23176080Y12172529D01*
X23169572Y12175225D01*
Y12208779D01*
X23176080Y12211474D01*
X23201794Y12231206D01*
X23221527Y12256921D01*
X23233931Y12286866D01*
X23238162Y12319002D01*
X23233931Y12351138D01*
X23221527Y12381083D01*
X23201794Y12406798D01*
X23176080Y12426530D01*
X23169574Y12429225D01*
Y12462779D01*
X23176080Y12465474D01*
X23201794Y12485206D01*
X23221527Y12510921D01*
X23233931Y12540866D01*
X23238162Y12573002D01*
X23233931Y12605138D01*
X23221527Y12635083D01*
X23201794Y12660798D01*
X23176080Y12680530D01*
X23169574Y12683225D01*
Y12716779D01*
X23176080Y12719474D01*
X23201794Y12739206D01*
X23221527Y12764921D01*
X23233931Y12794866D01*
X23238162Y12827002D01*
X23233931Y12859138D01*
X23221527Y12889082D01*
X23201794Y12914798D01*
X23176080Y12934531D01*
X23169574Y12937225D01*
Y12970779D01*
X23176080Y12973474D01*
X23201794Y12993205D01*
X23221527Y13018921D01*
X23233931Y13048866D01*
X23238162Y13081001D01*
X23233931Y13113138D01*
X23221527Y13143083D01*
X23201794Y13168797D01*
X23176080Y13188530D01*
X23169574Y13191225D01*
Y13224779D01*
X23176080Y13227473D01*
X23201794Y13247206D01*
X23221527Y13272922D01*
X23233931Y13302866D01*
X23238162Y13335002D01*
X23233931Y13367139D01*
X23221527Y13397083D01*
X23201794Y13422798D01*
X23176080Y13442529D01*
X23169574Y13445226D01*
Y13478780D01*
X23176080Y13481474D01*
X23201794Y13501205D01*
X23221527Y13526921D01*
X23233931Y13556866D01*
X23238162Y13589001D01*
X23233931Y13621138D01*
X23221527Y13651083D01*
X23201794Y13676797D01*
X23176080Y13696530D01*
X23169574Y13699225D01*
Y13732779D01*
X23176080Y13735474D01*
X23201794Y13755206D01*
X23221527Y13780920D01*
X23233931Y13810866D01*
X23238162Y13843002D01*
X23233931Y13875137D01*
X23221527Y13905083D01*
X23201794Y13930798D01*
X23176080Y13950529D01*
X23169574Y13953226D01*
Y13986778D01*
X23176080Y13989474D01*
X23201794Y14009206D01*
X23221527Y14034921D01*
X23233931Y14064867D01*
X23238162Y14097002D01*
X23233931Y14129138D01*
X23221527Y14159084D01*
X23201794Y14184798D01*
X23176080Y14204530D01*
X23169574Y14207225D01*
Y14240779D01*
X23176080Y14243474D01*
X23201794Y14263206D01*
X23221527Y14288921D01*
X23233931Y14318866D01*
X23238162Y14351003D01*
X23233931Y14383138D01*
X23221527Y14413083D01*
X23201794Y14438799D01*
X23176080Y14458530D01*
X23169574Y14461224D01*
Y14494778D01*
X23176080Y14497475D01*
X23201794Y14517206D01*
X23221527Y14542921D01*
X23233931Y14572865D01*
X23238162Y14605002D01*
X23233931Y14637138D01*
X23221527Y14667084D01*
X23201794Y14692798D01*
X23176080Y14712531D01*
X23169574Y14715225D01*
Y14748779D01*
X23176080Y14751474D01*
X23201794Y14771207D01*
X23221527Y14796921D01*
X23233931Y14826866D01*
X23238162Y14859003D01*
X23233931Y14891138D01*
X23221527Y14921083D01*
X23201794Y14946799D01*
X23176080Y14966530D01*
X23169574Y14969225D01*
Y15002779D01*
X23176080Y15005473D01*
X23201794Y15025206D01*
X23221527Y15050922D01*
X23233931Y15080865D01*
X23238162Y15113002D01*
X23233931Y15145139D01*
X23221527Y15175082D01*
X23201794Y15200798D01*
X23176080Y15220531D01*
X23169574Y15223225D01*
Y15256779D01*
X23176080Y15259474D01*
X23201794Y15279205D01*
X23221527Y15304921D01*
X23233931Y15334866D01*
X23238162Y15367001D01*
X23233931Y15399138D01*
X23221527Y15429083D01*
X23201794Y15454797D01*
X23176080Y15474530D01*
X23169574Y15477225D01*
Y15510779D01*
X23176080Y15513474D01*
X23201794Y15533206D01*
X23221527Y15558920D01*
X23233931Y15588866D01*
X23238162Y15621002D01*
X23233931Y15653139D01*
X23221527Y15683083D01*
X23201794Y15708798D01*
X23176080Y15728529D01*
X23169574Y15731226D01*
Y15764780D01*
X23176080Y15767474D01*
X23201794Y15787206D01*
X23221527Y15812921D01*
X23233931Y15842867D01*
X23238162Y15875002D01*
X23233931Y15907137D01*
X23221527Y15937083D01*
X23201794Y15962798D01*
X23176080Y15982529D01*
X23169574Y15985225D01*
Y16018779D01*
X23176080Y16021474D01*
X23201794Y16041206D01*
X23221527Y16066920D01*
X23233931Y16096866D01*
X23238162Y16129002D01*
X23233931Y16161137D01*
X23221527Y16191083D01*
X23201794Y16216798D01*
X23176080Y16236530D01*
X23169572Y16239224D01*
Y16272778D01*
X23176080Y16275475D01*
X23201794Y16295206D01*
X23221527Y16320921D01*
X23233931Y16350867D01*
X23238162Y16383002D01*
X23233931Y16415138D01*
X23221527Y16445084D01*
X23201794Y16470798D01*
X23176080Y16490530D01*
X23169574Y16493225D01*
Y16526779D01*
X23176080Y16529474D01*
X23201794Y16549207D01*
X23221527Y16574921D01*
X23233931Y16604866D01*
X23238162Y16637003D01*
X23233931Y16669138D01*
X23221527Y16699083D01*
X23201794Y16724799D01*
X23176080Y16744530D01*
X23146135Y16756934D01*
X23113998Y16761163D01*
X23081863Y16756934D01*
X23051918Y16744530D01*
X23026204Y16724799D01*
X23006471Y16699083D01*
X22994067Y16669138D01*
X22989838Y16637003D01*
X22994067Y16604866D01*
X23006471Y16574921D01*
X23026204Y16549207D01*
X23051918Y16529474D01*
X23058424Y16526779D01*
Y16493225D01*
X23051918Y16490530D01*
X23026204Y16470798D01*
X23006471Y16445084D01*
X22994067Y16415138D01*
X22989838Y16383002D01*
X22994067Y16350867D01*
X23006471Y16320921D01*
X23026204Y16295206D01*
X23051918Y16275475D01*
X23058426Y16272778D01*
Y16239224D01*
X23051918Y16236530D01*
X23026204Y16216798D01*
X23006471Y16191083D01*
X22994067Y16161137D01*
X22989838Y16129002D01*
X22994067Y16096866D01*
X23006471Y16066920D01*
X23026204Y16041206D01*
X23051918Y16021474D01*
X23058424Y16018779D01*
Y15985225D01*
X23051918Y15982529D01*
X23026204Y15962798D01*
X23006471Y15937083D01*
X22994067Y15907137D01*
X22989838Y15875002D01*
X22994067Y15842867D01*
X23006471Y15812921D01*
X23026204Y15787206D01*
X23043362Y15774040D01*
X23046832Y15744687D01*
X23045062Y15736758D01*
X23030634Y15723479D01*
X22674663D01*
X22668082Y15728529D01*
X22661574Y15731226D01*
Y15764780D01*
X22668082Y15767474D01*
X22693794Y15787206D01*
X22713527Y15812921D01*
X22725931Y15842867D01*
X22730162Y15875002D01*
X22725931Y15907137D01*
X22713527Y15937083D01*
X22693794Y15962798D01*
X22668082Y15982529D01*
X22661574Y15985225D01*
Y16018779D01*
X22668082Y16021474D01*
X22693794Y16041206D01*
X22713527Y16066920D01*
X22725931Y16096866D01*
X22730162Y16129002D01*
X22725931Y16161137D01*
X22713527Y16191083D01*
X22693794Y16216798D01*
X22668082Y16236530D01*
X22661572Y16239224D01*
Y16272778D01*
X22668082Y16275475D01*
X22693794Y16295206D01*
X22713527Y16320921D01*
X22725931Y16350867D01*
X22730162Y16383002D01*
X22725931Y16415138D01*
X22713527Y16445084D01*
X22693794Y16470798D01*
X22668082Y16490530D01*
X22661574Y16493225D01*
Y16526779D01*
X22668082Y16529474D01*
X22693794Y16549207D01*
X22713527Y16574921D01*
X22725931Y16604866D01*
X22730162Y16637003D01*
X22725931Y16669138D01*
X22713527Y16699083D01*
X22693794Y16724799D01*
X22668082Y16744530D01*
X22638135Y16756934D01*
X22606000Y16761163D01*
X22573865Y16756934D01*
X22543918Y16744530D01*
X22518204Y16724799D01*
X22498473Y16699083D01*
X22486069Y16669138D01*
X22481837Y16637003D01*
X22486069Y16604866D01*
X22498473Y16574921D01*
X22518204Y16549207D01*
X22543918Y16529474D01*
X22550426Y16526779D01*
Y16493225D01*
X22543918Y16490530D01*
X22518204Y16470798D01*
X22498473Y16445084D01*
X22486069Y16415138D01*
X22481837Y16383002D01*
X22486069Y16350867D01*
X22498473Y16320921D01*
X22518204Y16295206D01*
X22543918Y16275475D01*
X22550426Y16272778D01*
Y16239224D01*
X22543918Y16236530D01*
X22518204Y16216798D01*
X22498473Y16191083D01*
X22486069Y16161137D01*
X22481837Y16129002D01*
X22486069Y16096866D01*
X22498473Y16066920D01*
X22518204Y16041206D01*
X22543918Y16021474D01*
X22550426Y16018779D01*
Y15985225D01*
X22543918Y15982529D01*
X22518204Y15962798D01*
X22498473Y15937083D01*
X22486069Y15907137D01*
X22481837Y15875002D01*
X22486069Y15842867D01*
X22498473Y15812921D01*
X22518204Y15787206D01*
X22535362Y15774040D01*
X22538832Y15744687D01*
X22537064Y15736758D01*
X22522633Y15723479D01*
X17974849D01*
X17831677Y15866652D01*
Y16586198D01*
X17831677Y16586200D01*
X17828185Y16612723D01*
X17817947Y16637437D01*
X17801662Y16658662D01*
X17801662Y16658662D01*
X17531630Y16928694D01*
X17528674Y16951146D01*
X17515262Y16983524D01*
X17493929Y17011328D01*
X17466124Y17032661D01*
X17433746Y17046074D01*
X17399001Y17050648D01*
D02*
G37*
G36*
X16510001Y9385076D02*
X16480475Y9381189D01*
X16452962Y9369793D01*
X16429337Y9351664D01*
X16411208Y9328038D01*
X16399811Y9300525D01*
X16395924Y9271000D01*
X16399811Y9241475D01*
X16411208Y9213963D01*
X16429337Y9190336D01*
X16452962Y9172208D01*
X16480475Y9160811D01*
X16510001Y9156925D01*
X16539525Y9160811D01*
X16567038Y9172208D01*
X16590665Y9190336D01*
X16608794Y9213963D01*
X16620189Y9241475D01*
X16624075Y9271000D01*
X16620189Y9300525D01*
X16608794Y9328038D01*
X16590665Y9351664D01*
X16567038Y9369793D01*
X16539525Y9381189D01*
X16510001Y9385076D01*
D02*
G37*
G36*
Y8877075D02*
X16480475Y8873189D01*
X16452962Y8861792D01*
X16429337Y8843664D01*
X16411208Y8820037D01*
X16399811Y8792525D01*
X16395924Y8763000D01*
X16399811Y8733475D01*
X16411208Y8705962D01*
X16429337Y8682336D01*
X16452962Y8664207D01*
X16480475Y8652811D01*
X16510001Y8648924D01*
X16539525Y8652811D01*
X16567038Y8664207D01*
X16590665Y8682336D01*
X16608794Y8705962D01*
X16620189Y8733475D01*
X16624075Y8763000D01*
X16620189Y8792525D01*
X16608794Y8820037D01*
X16590665Y8843664D01*
X16567038Y8861792D01*
X16539525Y8873189D01*
X16510001Y8877075D01*
D02*
G37*
G36*
X16002000D02*
X15972475Y8873189D01*
X15944962Y8861792D01*
X15921336Y8843664D01*
X15903207Y8820038D01*
X15891811Y8792525D01*
X15887924Y8763000D01*
X15891811Y8733475D01*
X15903207Y8705962D01*
X15921336Y8682336D01*
X15944962Y8664207D01*
X15972475Y8652811D01*
X16002000Y8648924D01*
X16031525Y8652811D01*
X16059038Y8664207D01*
X16082664Y8682336D01*
X16100792Y8705962D01*
X16112189Y8733475D01*
X16116075Y8763000D01*
X16112189Y8792525D01*
X16100792Y8820038D01*
X16082664Y8843664D01*
X16059038Y8861792D01*
X16031525Y8873189D01*
X16002000Y8877075D01*
D02*
G37*
G36*
X15113000Y8628119D02*
X15082170Y8624060D01*
X15053441Y8612160D01*
X15028770Y8593230D01*
X15009840Y8568559D01*
X15002699Y8551322D01*
X14969299D01*
X14962160Y8568559D01*
X14943230Y8593230D01*
X14918559Y8612160D01*
X14889830Y8624060D01*
X14859000Y8628119D01*
X14828169Y8624060D01*
X14799442Y8612160D01*
X14774770Y8593230D01*
X14755840Y8568559D01*
X14754100Y8564359D01*
X14723100Y8570525D01*
Y8627100D01*
X14486900D01*
Y8390900D01*
X14723100D01*
Y8447475D01*
X14754100Y8453641D01*
X14755840Y8449441D01*
X14774770Y8424770D01*
X14799442Y8405840D01*
X14828169Y8393940D01*
X14859000Y8389881D01*
X14889830Y8393940D01*
X14918559Y8405840D01*
X14943230Y8424770D01*
X14962160Y8449441D01*
X14969299Y8466678D01*
X15002699D01*
X15009840Y8449441D01*
X15028770Y8424770D01*
X15053441Y8405840D01*
X15082170Y8393940D01*
X15113000Y8389881D01*
X15143829Y8393940D01*
X15172559Y8405840D01*
X15197231Y8424770D01*
X15216161Y8449441D01*
X15228059Y8478170D01*
X15232120Y8509000D01*
X15228059Y8539830D01*
X15216161Y8568559D01*
X15197231Y8593230D01*
X15172559Y8612160D01*
X15143829Y8624060D01*
X15113000Y8628119D01*
D02*
G37*
G36*
X17399001Y8643248D02*
X17364255Y8638674D01*
X17331876Y8625262D01*
X17304073Y8603928D01*
X17282738Y8576124D01*
X17269325Y8543746D01*
X17264752Y8509000D01*
X17269325Y8474254D01*
X17282738Y8441876D01*
X17304073Y8414072D01*
X17331876Y8392738D01*
X17364255Y8379326D01*
X17399001Y8374752D01*
X17433746Y8379326D01*
X17466124Y8392738D01*
X17493929Y8414072D01*
X17515262Y8441876D01*
X17528674Y8474254D01*
X17533247Y8509000D01*
X17528674Y8543746D01*
X17515262Y8576124D01*
X17493929Y8603928D01*
X17466124Y8625262D01*
X17433746Y8638674D01*
X17399001Y8643248D01*
D02*
G37*
G36*
X15621001Y8247119D02*
X15590170Y8243060D01*
X15561441Y8231160D01*
X15536771Y8212230D01*
X15517841Y8187559D01*
X15505940Y8158830D01*
X15501881Y8128000D01*
X15505940Y8097170D01*
X15517841Y8068441D01*
X15536771Y8043770D01*
X15561441Y8024840D01*
X15590170Y8012940D01*
X15621001Y8008881D01*
X15651830Y8012940D01*
X15680559Y8024840D01*
X15705231Y8043770D01*
X15724159Y8068441D01*
X15736060Y8097170D01*
X15740118Y8128000D01*
X15736060Y8158830D01*
X15724159Y8187559D01*
X15705231Y8212230D01*
X15680559Y8231160D01*
X15651830Y8243060D01*
X15621001Y8247119D01*
D02*
G37*
G36*
X14605000D02*
X14574170Y8243060D01*
X14545441Y8231160D01*
X14520770Y8212230D01*
X14501840Y8187559D01*
X14489940Y8158830D01*
X14485881Y8128000D01*
X14489940Y8097170D01*
X14501840Y8068441D01*
X14520770Y8043770D01*
X14545441Y8024840D01*
X14574170Y8012940D01*
X14605000Y8008881D01*
X14635831Y8012940D01*
X14664558Y8024840D01*
X14689230Y8043770D01*
X14708160Y8068441D01*
X14720061Y8097170D01*
X14724120Y8128000D01*
X14720061Y8158830D01*
X14708160Y8187559D01*
X14689230Y8212230D01*
X14664558Y8231160D01*
X14635831Y8243060D01*
X14605000Y8247119D01*
D02*
G37*
%LPD*%
G36*
X9684965Y15091388D02*
X9450688Y14857112D01*
X9439695Y14842786D01*
X9432785Y14826103D01*
X9430428Y14808200D01*
Y13846252D01*
X9293148Y13708972D01*
X8486852D01*
X8324172Y13871652D01*
Y13936308D01*
X8349928Y13956071D01*
X8371262Y13983876D01*
X8384674Y14016254D01*
X8389248Y14050999D01*
X8384674Y14085745D01*
X8371262Y14118124D01*
X8349928Y14145927D01*
X8324172Y14165691D01*
Y14213309D01*
X8349928Y14233072D01*
X8371262Y14260876D01*
X8384674Y14293254D01*
X8389248Y14328000D01*
X8384674Y14362746D01*
X8371262Y14395123D01*
X8349928Y14422928D01*
X8324172Y14442691D01*
Y14490309D01*
X8349928Y14510072D01*
X8371262Y14537875D01*
X8384674Y14570255D01*
X8389248Y14605000D01*
X8384674Y14639746D01*
X8371262Y14672124D01*
X8358180Y14689174D01*
X8380686Y14711679D01*
X8412921Y14700073D01*
X8422738Y14676376D01*
X8444072Y14648572D01*
X8469828Y14628809D01*
Y14581190D01*
X8444072Y14561427D01*
X8422738Y14533624D01*
X8409326Y14501247D01*
X8404752Y14466499D01*
X8409326Y14431754D01*
X8422738Y14399376D01*
X8444072Y14371571D01*
X8469828Y14351810D01*
Y14304192D01*
X8444072Y14284428D01*
X8422738Y14256624D01*
X8409326Y14224246D01*
X8404752Y14189500D01*
X8409326Y14154755D01*
X8422738Y14122375D01*
X8444072Y14094572D01*
X8469828Y14074809D01*
Y14027191D01*
X8444072Y14007426D01*
X8422738Y13979623D01*
X8409326Y13947244D01*
X8404752Y13912498D01*
X8409326Y13877754D01*
X8422738Y13845375D01*
X8444072Y13817572D01*
X8471876Y13796237D01*
X8504254Y13782825D01*
X8539000Y13778252D01*
X8573746Y13782825D01*
X8606124Y13796237D01*
X8633928Y13817572D01*
X8655262Y13845375D01*
X8668674Y13877754D01*
X8673248Y13912498D01*
X8668674Y13947244D01*
X8655262Y13979623D01*
X8633928Y14007426D01*
X8608172Y14027191D01*
Y14074809D01*
X8633928Y14094572D01*
X8655262Y14122375D01*
X8668674Y14154755D01*
X8673248Y14189500D01*
X8668674Y14224246D01*
X8655262Y14256624D01*
X8633928Y14284428D01*
X8608172Y14304192D01*
Y14351810D01*
X8633928Y14371571D01*
X8655262Y14399376D01*
X8668674Y14431754D01*
X8673248Y14466499D01*
X8668674Y14501247D01*
X8655262Y14533624D01*
X8633928Y14561427D01*
X8608172Y14581190D01*
Y14628809D01*
X8633928Y14648572D01*
X8655262Y14676376D01*
X8668674Y14708754D01*
X8673248Y14743500D01*
X8669011Y14775687D01*
X9013352Y15120029D01*
X9083527D01*
X9098815Y15089027D01*
X9097738Y15087624D01*
X9084326Y15055246D01*
X9079752Y15020500D01*
X9084326Y14985754D01*
X9095157Y14959605D01*
X9034615Y14899065D01*
X9023388Y14882262D01*
X9019445Y14862440D01*
Y14767694D01*
X8980075Y14728325D01*
X8964746Y14734674D01*
X8930000Y14739249D01*
X8895254Y14734674D01*
X8862876Y14721262D01*
X8835072Y14699928D01*
X8813738Y14672124D01*
X8800326Y14639746D01*
X8795752Y14605000D01*
X8800326Y14570255D01*
X8813738Y14537875D01*
X8835072Y14510072D01*
X8862876Y14488737D01*
X8876059Y14483276D01*
Y14449722D01*
X8862876Y14444263D01*
X8835072Y14422928D01*
X8813738Y14395123D01*
X8800326Y14362746D01*
X8795752Y14328000D01*
X8800326Y14293254D01*
X8813738Y14260875D01*
X8835072Y14233072D01*
X8862876Y14211737D01*
X8876059Y14206277D01*
Y14172722D01*
X8862876Y14167262D01*
X8835072Y14145927D01*
X8813738Y14118124D01*
X8800326Y14085745D01*
X8795752Y14050999D01*
X8800326Y14016254D01*
X8813738Y13983875D01*
X8835072Y13956071D01*
X8862876Y13934737D01*
X8895254Y13921326D01*
X8930000Y13916751D01*
X8964746Y13921326D01*
X8997124Y13934737D01*
X9024928Y13956071D01*
X9046263Y13983875D01*
X9059674Y14016254D01*
X9064249Y14050999D01*
X9059674Y14085745D01*
X9046263Y14118124D01*
X9024928Y14145927D01*
X8997124Y14167262D01*
X8983942Y14172722D01*
Y14206277D01*
X8997124Y14211737D01*
X9024928Y14233072D01*
X9046263Y14260875D01*
X9059674Y14293254D01*
X9064249Y14328000D01*
X9059674Y14362746D01*
X9046263Y14395123D01*
X9024928Y14422928D01*
X8997124Y14444263D01*
X8983942Y14449722D01*
Y14483276D01*
X8997124Y14488737D01*
X9024928Y14510072D01*
X9046263Y14537875D01*
X9059674Y14570255D01*
X9064249Y14605000D01*
X9059674Y14639746D01*
X9057562Y14644846D01*
X9076641Y14666309D01*
X9107668Y14663434D01*
X9119072Y14648572D01*
X9146876Y14627237D01*
X9160058Y14621777D01*
Y14588223D01*
X9146876Y14582762D01*
X9119072Y14561427D01*
X9097738Y14533624D01*
X9084326Y14501247D01*
X9079752Y14466499D01*
X9084326Y14431754D01*
X9097738Y14399376D01*
X9119072Y14371571D01*
X9146876Y14350237D01*
X9160059Y14344777D01*
Y14311223D01*
X9146876Y14305762D01*
X9119072Y14284428D01*
X9097738Y14256624D01*
X9084326Y14224246D01*
X9079752Y14189500D01*
X9084326Y14154755D01*
X9097738Y14122375D01*
X9119072Y14094572D01*
X9146876Y14073238D01*
X9160059Y14067776D01*
Y14034222D01*
X9146876Y14028761D01*
X9119072Y14007426D01*
X9097738Y13979623D01*
X9084326Y13947244D01*
X9079752Y13912498D01*
X9084326Y13877754D01*
X9097738Y13845375D01*
X9119072Y13817572D01*
X9146876Y13796237D01*
X9179254Y13782825D01*
X9214000Y13778252D01*
X9248746Y13782825D01*
X9281124Y13796237D01*
X9308928Y13817572D01*
X9330263Y13845375D01*
X9343674Y13877754D01*
X9348249Y13912498D01*
X9343674Y13947244D01*
X9330263Y13979623D01*
X9308928Y14007426D01*
X9281124Y14028761D01*
X9267942Y14034222D01*
Y14067776D01*
X9281124Y14073238D01*
X9308928Y14094572D01*
X9330263Y14122375D01*
X9343674Y14154755D01*
X9348249Y14189500D01*
X9343674Y14224246D01*
X9330263Y14256624D01*
X9308928Y14284428D01*
X9281124Y14305762D01*
X9267942Y14311223D01*
Y14344777D01*
X9281124Y14350237D01*
X9308928Y14371571D01*
X9330263Y14399376D01*
X9343674Y14431754D01*
X9348249Y14466499D01*
X9343674Y14501247D01*
X9330263Y14533624D01*
X9308928Y14561427D01*
X9281124Y14582762D01*
X9267942Y14588223D01*
Y14621777D01*
X9281124Y14627237D01*
X9308928Y14648572D01*
X9330263Y14676376D01*
X9343674Y14708754D01*
X9348249Y14743500D01*
X9343674Y14778246D01*
X9330263Y14810625D01*
X9308928Y14838428D01*
X9281124Y14859763D01*
X9267942Y14865224D01*
Y14898776D01*
X9281124Y14904237D01*
X9308928Y14925572D01*
X9330263Y14953375D01*
X9343674Y14985754D01*
X9348249Y15020500D01*
X9343674Y15055246D01*
X9330263Y15087624D01*
X9329185Y15089027D01*
X9344473Y15120029D01*
X9673102D01*
X9684965Y15091388D01*
D02*
G37*
D10*
X11684000Y11303000D02*
X13309599Y12928600D01*
X14605000Y15087601D02*
X15087601Y14605000D01*
X9779000Y15087601D02*
X14605000D01*
X9499600Y14808200D02*
X9779000Y15087601D01*
X8539000Y14743500D02*
X8984700Y15189200D01*
X12725400D02*
X13919200Y16383000D01*
X8984700Y15189200D02*
X12725400D01*
X9499600Y13817599D02*
Y14808200D01*
X9321800Y13639799D02*
X9499600Y13817599D01*
X16789400Y13487399D02*
X17017999Y13716000D01*
X17017999D01*
X16789400Y10947400D02*
X16789401D01*
X17017999Y11176000D01*
X17703799Y12242800D02*
X17729201D01*
X17399001Y11938000D02*
X17703799Y12242800D01*
X17399001Y14478000D02*
X17729201Y14808200D01*
X12379431Y11849100D02*
X14439900D01*
X11706331Y11176000D02*
X12379431Y11849100D01*
X14439900D02*
X14655800Y12065000D01*
X10820400Y11176000D02*
X11706331D01*
X10058400Y10414000D02*
X10820400Y11176000D01*
X13284200Y12928600D02*
X13309599D01*
X13030200Y12801601D02*
Y12928600D01*
X11658600Y11430000D02*
X13030200Y12801601D01*
X10033000Y11430000D02*
X11658600D01*
X10439400Y11303000D02*
X11684000D01*
X10058400Y10922000D02*
X10439400Y11303000D01*
X8458200Y13639799D02*
X9321800D01*
X15087601Y14605000D02*
X15113000D01*
X13919200Y16383000D02*
X13944600D01*
X15824200Y11861800D02*
X16002000Y11684000D01*
X15036800Y11861800D02*
X15824200D01*
X14859000Y11684000D02*
X15036800Y11861800D01*
X15824200Y9448800D02*
X16002000Y9271000D01*
X15036800Y9448800D02*
X15824200D01*
X14859000Y9271000D02*
X15036800Y9448800D01*
X14859000Y14224001D02*
X15036800Y14401801D01*
X15824200D01*
X16002000Y14224001D01*
X15986020Y16662399D02*
X16002000D01*
X15808220Y16840199D02*
X15986020Y16662399D01*
X15036800Y16840199D02*
X15808220D01*
X14859000Y16662399D02*
X15036800Y16840199D01*
X14655800Y12065000D02*
X15113000D01*
X14859000Y9906000D02*
X15113000Y9652000D01*
X10083800Y9906000D02*
X14859000D01*
X8255000Y13842999D02*
X8458200Y13639799D01*
X8255000Y13842999D02*
Y14050999D01*
X13944600Y16383000D02*
X14605000Y17043401D01*
X15113000D01*
X8255000Y14050999D02*
Y14328000D01*
Y14605000D01*
X8539000Y14466499D02*
Y14743500D01*
Y14189500D02*
Y14466499D01*
Y13912498D02*
Y14189500D01*
D11*
X21442172Y9273156D02*
X21444325Y9271002D01*
X22606000D01*
X23113998D01*
X16789400Y13487399D02*
Y15925800D01*
Y13487399D02*
X16789400Y10947400D01*
X16789400Y8763000D01*
Y8509000D02*
Y8763000D01*
X16789400Y8763000D01*
X17017999D01*
X16789400Y8509000D02*
X17094200Y8204200D01*
X16789400Y15925800D02*
X17017999Y16154401D01*
X17094200Y8204200D02*
X19809583D01*
X20874226Y9268844D01*
X17729201Y12242800D02*
Y14808200D01*
Y9855200D02*
Y12242800D01*
Y14808200D02*
Y15417799D01*
X17932402Y15621002D01*
X17729201Y15824203D02*
X17932402Y15621002D01*
X17729201Y15824203D02*
Y16586200D01*
X17399001Y16916400D02*
X17729201Y16586200D01*
X17399001Y9525000D02*
X17729201Y9855200D01*
X17932402Y15621002D02*
X22606000D01*
X23113998D01*
D12*
X17518324Y5024175D02*
X17653000Y4889500D01*
X17518324Y5024175D02*
X17460606Y4966457D01*
X17447781Y4940805D01*
Y4927979D01*
X17454195Y4908739D01*
X17467020Y4895913D01*
X17486259Y4889500D01*
X17499086D01*
X17524738Y4902326D01*
X17582455Y4960044D02*
X17524738Y4902326D01*
X17511913Y4876674D01*
Y4863848D01*
X17518324Y4844608D01*
X17537564Y4825369D01*
X17556804Y4818956D01*
X17569630D01*
X17595282Y4831782D01*
X17653000Y4889500D01*
X17411226Y4827293D02*
X17430466Y4833706D01*
X17456117D01*
X17481770Y4820880D01*
X17494595Y4808054D01*
X17507423Y4782401D01*
Y4756749D01*
X17501010Y4737510D01*
X17481770Y4718270D01*
X17462531Y4711857D01*
X17436879Y4711857D01*
X17411226Y4724683D01*
X17398399Y4737510D01*
X17385574Y4763162D01*
X17385574Y4788814D01*
X17391988Y4808054D01*
X17411226Y4827293D01*
X17266290Y4772140D02*
X17375313Y4663118D01*
X17388139Y4637465D01*
X17381726Y4618226D01*
X17368900Y4605400D01*
X17330421Y4746488D02*
X17285530Y4701596D01*
X17195746Y4701596D02*
X17304768Y4592574D01*
X17317595Y4566921D01*
X17311182Y4547682D01*
X17298357Y4534856D01*
X17259877Y4675944D02*
X17214986Y4631052D01*
X17157268Y4573335D02*
X17176508Y4579748D01*
X17202159D01*
X17227812Y4566921D01*
X17240639Y4554095D01*
X17253464Y4528443D01*
Y4502790D01*
X17247050Y4483551D01*
X17227812Y4464312D01*
X17208572Y4457899D01*
X17182919Y4457899D01*
X17157268Y4470725D01*
X17144443Y4483551D01*
X17131615Y4509203D01*
X17131615Y4534856D01*
X17138028Y4554095D01*
X17157268Y4573335D01*
X17076463Y4492529D02*
X17166246Y4402746D01*
X17102115Y4466877D02*
X17063637D01*
X17044397Y4460464D01*
X17025159Y4441225D01*
X17018745Y4421985D01*
X17031570Y4396333D01*
X17095702Y4332202D01*
X17031570Y4396333D02*
X16993092D01*
X16973853Y4389920D01*
X16954614Y4370681D01*
X16948201Y4351441D01*
X16961028Y4325789D01*
X17025159Y4261658D01*
X16742342Y4248190D02*
X16877016Y4113516D01*
X16800058Y4036558D01*
X16618568Y4034634D02*
X16708351Y3944851D01*
X16637807Y4015395D02*
X16637807Y4041048D01*
X16644220Y4060287D01*
X16663458Y4079526D01*
X16682700Y4085939D01*
X16708351D01*
X16734004Y4073113D01*
X16746831Y4060287D01*
X16759656Y4034634D01*
Y4008982D01*
X16753242Y3989743D01*
X16734004Y3970504D01*
X16714764Y3964091D01*
X16689111Y3964090D01*
X16576241Y3992308D02*
X16627547Y3864046D01*
X16499284Y3915351D02*
X16627547Y3864046D01*
X16666025Y3851220D01*
X16691676D01*
X16710916Y3857633D01*
X16717329Y3864046D01*
X16515317Y3854427D02*
X16438361Y3777469D01*
X16425534Y3790295D01*
X16419121Y3809535D01*
X16419121Y3822361D01*
X16425534Y3841600D01*
X16444772Y3860840D01*
X16464012Y3867253D01*
X16489665D01*
X16515317Y3854427D01*
X16528143Y3841600D01*
X16540968Y3815948D01*
Y3790296D01*
X16534557Y3771056D01*
X16515317Y3751817D01*
X16496078Y3745404D01*
X16470425D01*
X16371022Y3787089D02*
X16460806Y3697306D01*
X16409502Y3748610D02*
X16383849Y3761437D01*
X16358195D01*
X16338957Y3755024D01*
X16319717Y3735785D01*
D13*
X16408676Y3428946D02*
X16287750Y3259649D01*
X16469141D01*
X16408676Y3428946D02*
Y3175000D01*
D14*
X9067800Y9906000D02*
D03*
X10083800D02*
D03*
X14859000Y9271000D02*
D03*
X14605000D02*
D03*
X15113000D02*
D03*
Y8509000D02*
D03*
X14859000D02*
D03*
Y15900400D02*
D03*
X15113000D02*
D03*
Y16662399D02*
D03*
X14605000D02*
D03*
X14859000D02*
D03*
X15113000Y17043401D02*
D03*
X14097000D02*
D03*
X14605000Y15519400D02*
D03*
X15621001D02*
D03*
X14859000Y13462000D02*
D03*
X15113000D02*
D03*
Y14224001D02*
D03*
X14605000D02*
D03*
X14859000D02*
D03*
Y10922000D02*
D03*
X15113000D02*
D03*
Y11684000D02*
D03*
X14605000D02*
D03*
X14859000D02*
D03*
X15494000Y17043401D02*
D03*
X16510001D02*
D03*
X10033000Y11430000D02*
D03*
X9017000D02*
D03*
X14605000Y13081000D02*
D03*
X15621001D02*
D03*
X15494000Y14605000D02*
D03*
X16510001D02*
D03*
X15113000D02*
D03*
X14097000D02*
D03*
X10058400Y10922000D02*
D03*
X9042400D02*
D03*
X14605000Y10541000D02*
D03*
X15621001D02*
D03*
X15494000Y12065000D02*
D03*
X16510001D02*
D03*
X15113000D02*
D03*
X14097000D02*
D03*
X10058400Y10414000D02*
D03*
X9042400D02*
D03*
X15621001Y8128000D02*
D03*
X14605000D02*
D03*
X16510001Y9652000D02*
D03*
X15494000D02*
D03*
X14097000D02*
D03*
X15113000D02*
D03*
D15*
X16510001Y8763000D02*
D03*
X16002000D02*
D03*
X17017999Y9271000D02*
D03*
Y8763000D02*
D03*
X16510001Y9271000D02*
D03*
X16002000D02*
D03*
X8382000Y9906000D02*
D03*
Y10160000D02*
D03*
Y11684000D02*
D03*
Y11430000D02*
D03*
Y11176000D02*
D03*
Y10922000D02*
D03*
Y10668000D02*
D03*
Y10414000D02*
D03*
X16002000Y16662399D02*
D03*
X16510001D02*
D03*
X17017999Y16154401D02*
D03*
Y16662399D02*
D03*
X16002000Y16154401D02*
D03*
X16510001D02*
D03*
X16002000Y14224001D02*
D03*
X16510001D02*
D03*
X17017999Y13716000D02*
D03*
Y14224001D02*
D03*
X16002000Y13716000D02*
D03*
X16510001D02*
D03*
X16002000Y11684000D02*
D03*
X16510001D02*
D03*
X17017999Y11176000D02*
D03*
Y11684000D02*
D03*
X16002000Y11176000D02*
D03*
X16510001D02*
D03*
D16*
X9055000Y15716000D02*
D03*
X8255000D02*
D03*
X9055000Y13216998D02*
D03*
X8255000D02*
D03*
D17*
X8930000Y14605000D02*
D03*
X9214000Y13912498D02*
D03*
Y14189500D02*
D03*
Y14466499D02*
D03*
Y14743500D02*
D03*
Y15020500D02*
D03*
X8930000Y14882001D02*
D03*
Y14328000D02*
D03*
Y14050999D02*
D03*
X8255000Y14605000D02*
D03*
X8539000Y13912498D02*
D03*
Y14189500D02*
D03*
Y14466499D02*
D03*
Y14743500D02*
D03*
Y15020500D02*
D03*
X8255000Y14882001D02*
D03*
Y14328000D02*
D03*
Y14050999D02*
D03*
X17399001Y9525000D02*
D03*
Y8509000D02*
D03*
Y15900400D02*
D03*
Y16916400D02*
D03*
Y13462000D02*
D03*
Y14478000D02*
D03*
Y10922000D02*
D03*
Y11938000D02*
D03*
D18*
X8128000Y10033000D02*
D03*
Y11557000D02*
D03*
Y11049000D02*
D03*
Y10541000D02*
D03*
D19*
X23113998Y16637003D02*
D03*
Y16383002D02*
D03*
Y16129002D02*
D03*
Y15875002D02*
D03*
Y15621002D02*
D03*
Y15367001D02*
D03*
Y15113002D02*
D03*
Y14859003D02*
D03*
Y12827002D02*
D03*
Y13081001D02*
D03*
Y13335002D02*
D03*
Y13589001D02*
D03*
Y13843002D02*
D03*
Y14097002D02*
D03*
Y14351003D02*
D03*
Y14605002D02*
D03*
Y10795002D02*
D03*
Y11049002D02*
D03*
Y11303002D02*
D03*
Y11557002D02*
D03*
Y11811002D02*
D03*
Y12065002D02*
D03*
Y12319002D02*
D03*
Y12573002D02*
D03*
Y8763002D02*
D03*
Y9017002D02*
D03*
Y9271002D02*
D03*
Y9525002D02*
D03*
Y9779002D02*
D03*
Y10033002D02*
D03*
Y10287002D02*
D03*
Y10541002D02*
D03*
X22606000D02*
D03*
Y10287002D02*
D03*
Y10033002D02*
D03*
Y9779002D02*
D03*
Y9525002D02*
D03*
Y9271002D02*
D03*
Y9017002D02*
D03*
Y8763002D02*
D03*
Y12573002D02*
D03*
Y12319002D02*
D03*
Y12065002D02*
D03*
Y11811002D02*
D03*
Y11557002D02*
D03*
Y11303002D02*
D03*
Y11049002D02*
D03*
Y10795002D02*
D03*
Y14605002D02*
D03*
Y14351003D02*
D03*
Y14097002D02*
D03*
Y13843002D02*
D03*
Y13589001D02*
D03*
Y13335002D02*
D03*
Y13081001D02*
D03*
Y12827002D02*
D03*
Y14859003D02*
D03*
Y15113002D02*
D03*
Y15367001D02*
D03*
Y15621002D02*
D03*
Y15875002D02*
D03*
Y16129002D02*
D03*
Y16383002D02*
D03*
Y16637003D02*
D03*
D21*
X21442172Y9273156D02*
D03*
X20874226Y9268844D02*
D03*
D22*
X14605000Y8509000D02*
D03*
Y15900400D02*
D03*
Y13462000D02*
D03*
Y10922000D02*
D03*
D23*
X8001000Y8255000D02*
D03*
Y17145000D02*
D03*
D24*
X13284200Y12928600D02*
D03*
X13030200D02*
D03*
D25*
X9214000Y15005200D02*
Y15020500D01*
X9123798Y14914998D02*
X9214000Y15005200D01*
X9071240Y14862440D02*
X9123798Y14914998D01*
X9071240Y14746240D02*
Y14862440D01*
X8930000Y14605000D02*
X9071240Y14746240D01*
X8407400Y14888901D02*
X8539000Y15020500D01*
X8407400Y14811642D02*
Y14888901D01*
X8255000Y14659242D02*
X8407400Y14811642D01*
D26*
X8255000Y14605000D02*
Y14659242D01*
D27*
X23367999Y17145003D02*
D03*
Y8255002D02*
D03*
%TF.MD5,d5c3e64d0378d15b28cb76598362cb55*%
M02*
