%TF.GenerationSoftware,Altium Limited,Altium Designer,19.1.5 (86)*%
G04 Layer_Color=8388736*
%FSLAX45Y45*%
%MOMM*%
%TF.FileFunction,Other,Mechanical_14*%
%TF.Part,Single*%
G01*
G75*
%TA.AperFunction,NonConductor*%
%ADD23C,0.20000*%
%ADD25C,0.12700*%
%ADD30C,0.10000*%
D23*
X48443921Y12026600D02*
X48449634Y12015174D01*
X48466776Y11998035D01*
X48346799D01*
X18662878Y18833800D02*
X18657166Y18822374D01*
X18640025Y18805235D01*
X18760001D01*
X15614877Y18808400D02*
X15609164Y18796974D01*
X15592026Y18779836D01*
X15712000D01*
X16262122Y9048000D02*
X16267834Y9059426D01*
X16284975Y9076565D01*
X16164999D01*
X10280878Y13861000D02*
X10275165Y13849574D01*
X10258026Y13832436D01*
X10378000D01*
X11931878Y18814000D02*
X11926165Y18802574D01*
X11909026Y18785435D01*
X12029000D01*
X10280878Y18814000D02*
X10275165Y18802574D01*
X10258026Y18785435D01*
X10378000D01*
X7720499Y17966499D02*
X7760486D01*
X7740493D01*
Y18086461D01*
X7720499Y18066467D01*
X7580500Y14420500D02*
X7620487D01*
X7600493D01*
Y14540462D01*
X7580500Y14520468D01*
X7760442Y14540462D02*
X7680467D01*
Y14480479D01*
X7720454Y14500475D01*
X7740448D01*
X7760442Y14480479D01*
Y14440492D01*
X7740448Y14420500D01*
X7700461D01*
X7680467Y14440492D01*
X7640474Y13145499D02*
X7560500D01*
X7640474Y13225475D01*
Y13245467D01*
X7620480Y13265462D01*
X7580493D01*
X7560500Y13245467D01*
X7680461D02*
X7700454Y13265462D01*
X7740441D01*
X7760435Y13245467D01*
Y13165492D01*
X7740441Y13145499D01*
X7700454D01*
X7680461Y13165492D01*
Y13245467D01*
X7640474Y11875500D02*
X7560500D01*
X7640474Y11955474D01*
Y11975468D01*
X7620480Y11995461D01*
X7580493D01*
X7560500Y11975468D01*
X7760435Y11995461D02*
X7680461D01*
Y11935480D01*
X7720448Y11955474D01*
X7740441D01*
X7760435Y11935480D01*
Y11895493D01*
X7740441Y11875500D01*
X7700454D01*
X7680461Y11895493D01*
X7560500Y10705468D02*
X7580493Y10725461D01*
X7620480D01*
X7640474Y10705468D01*
Y10685474D01*
X7620480Y10665480D01*
X7600487D01*
X7620480D01*
X7640474Y10645487D01*
Y10625493D01*
X7620480Y10605500D01*
X7580493D01*
X7560500Y10625493D01*
X7680461Y10705468D02*
X7700454Y10725461D01*
X7740441D01*
X7760435Y10705468D01*
Y10625493D01*
X7740441Y10605500D01*
X7700454D01*
X7680461Y10625493D01*
Y10705468D01*
X7752974Y17070461D02*
X7673000D01*
Y17010480D01*
X7712987Y17030473D01*
X7732980D01*
X7752974Y17010480D01*
Y16970493D01*
X7732980Y16950500D01*
X7692993D01*
X7673000Y16970493D01*
X7560500Y10197468D02*
X7580493Y10217461D01*
X7620480D01*
X7640474Y10197468D01*
Y10177474D01*
X7620480Y10157480D01*
X7600487D01*
X7620480D01*
X7640474Y10137487D01*
Y10117493D01*
X7620480Y10097500D01*
X7580493D01*
X7560500Y10117493D01*
X7760435Y10097500D02*
X7680461D01*
X7760435Y10177474D01*
Y10197468D01*
X7740441Y10217461D01*
X7700454D01*
X7680461Y10197468D01*
X7580500Y15688000D02*
X7620487D01*
X7600493D01*
Y15807961D01*
X7580500Y15787968D01*
X7680467D02*
X7700461Y15807961D01*
X7740448D01*
X7760442Y15787968D01*
Y15707993D01*
X7740448Y15688000D01*
X7700461D01*
X7680467Y15707993D01*
Y15787968D01*
X8738474Y18407474D02*
X8678494D01*
X8658500Y18387482D01*
Y18347495D01*
X8678494Y18327499D01*
X8738474D01*
X7952894Y18509975D02*
X7992881D01*
X8012874Y18489981D01*
Y18430000D01*
X7952894D01*
X7932900Y18449994D01*
X7952894Y18469987D01*
X8012874D01*
X16864499Y17966499D02*
X16904486D01*
X16884492D01*
Y18086461D01*
X16864499Y18066467D01*
X16724500Y14420500D02*
X16764487D01*
X16744493D01*
Y14540462D01*
X16724500Y14520468D01*
X16904442Y14540462D02*
X16824467D01*
Y14480479D01*
X16864455Y14500475D01*
X16884448D01*
X16904442Y14480479D01*
Y14440492D01*
X16884448Y14420500D01*
X16844461D01*
X16824467Y14440492D01*
X16784474Y13145499D02*
X16704500D01*
X16784474Y13225475D01*
Y13245467D01*
X16764481Y13265462D01*
X16724493D01*
X16704500Y13245467D01*
X16824461D02*
X16844455Y13265462D01*
X16884441D01*
X16904436Y13245467D01*
Y13165492D01*
X16884441Y13145499D01*
X16844455D01*
X16824461Y13165492D01*
Y13245467D01*
X16784474Y11875500D02*
X16704500D01*
X16784474Y11955474D01*
Y11975468D01*
X16764481Y11995461D01*
X16724493D01*
X16704500Y11975468D01*
X16904436Y11995461D02*
X16824461D01*
Y11935480D01*
X16864449Y11955474D01*
X16884441D01*
X16904436Y11935480D01*
Y11895493D01*
X16884441Y11875500D01*
X16844455D01*
X16824461Y11895493D01*
X16704500Y10705468D02*
X16724493Y10725461D01*
X16764481D01*
X16784474Y10705468D01*
Y10685474D01*
X16764481Y10665480D01*
X16744487D01*
X16764481D01*
X16784474Y10645487D01*
Y10625493D01*
X16764481Y10605500D01*
X16724493D01*
X16704500Y10625493D01*
X16824461Y10705468D02*
X16844455Y10725461D01*
X16884441D01*
X16904436Y10705468D01*
Y10625493D01*
X16884441Y10605500D01*
X16844455D01*
X16824461Y10625493D01*
Y10705468D01*
X16896974Y17070461D02*
X16817000D01*
Y17010480D01*
X16856987Y17030473D01*
X16876981D01*
X16896974Y17010480D01*
Y16970493D01*
X16876981Y16950500D01*
X16836993D01*
X16817000Y16970493D01*
X16704500Y10197468D02*
X16724493Y10217461D01*
X16764481D01*
X16784474Y10197468D01*
Y10177474D01*
X16764481Y10157480D01*
X16744487D01*
X16764481D01*
X16784474Y10137487D01*
Y10117493D01*
X16764481Y10097500D01*
X16724493D01*
X16704500Y10117493D01*
X16904436Y10097500D02*
X16824461D01*
X16904436Y10177474D01*
Y10197468D01*
X16884441Y10217461D01*
X16844455D01*
X16824461Y10197468D01*
X16724500Y15688000D02*
X16764487D01*
X16744493D01*
Y15807961D01*
X16724500Y15787968D01*
X16824467D02*
X16844461Y15807961D01*
X16884448D01*
X16904442Y15787968D01*
Y15707993D01*
X16884448Y15688000D01*
X16844461D01*
X16824467Y15707993D01*
Y15787968D01*
X17882474Y18407474D02*
X17822495D01*
X17802499Y18387482D01*
Y18347495D01*
X17822495Y18327499D01*
X17882474D01*
X17096893Y18509975D02*
X17136880D01*
X17156874Y18489981D01*
Y18430000D01*
X17096893D01*
X17076900Y18449994D01*
X17096893Y18469987D01*
X17156874D01*
X13816499Y17966499D02*
X13856487D01*
X13836493D01*
Y18086461D01*
X13816499Y18066467D01*
X13676500Y14420500D02*
X13716487D01*
X13696494D01*
Y14540462D01*
X13676500Y14520468D01*
X13856442Y14540462D02*
X13776466D01*
Y14480479D01*
X13816454Y14500475D01*
X13836449D01*
X13856442Y14480479D01*
Y14440492D01*
X13836449Y14420500D01*
X13796461D01*
X13776466Y14440492D01*
X13736475Y13145499D02*
X13656500D01*
X13736475Y13225475D01*
Y13245467D01*
X13716479Y13265462D01*
X13676492D01*
X13656500Y13245467D01*
X13776460D02*
X13796454Y13265462D01*
X13836441D01*
X13856435Y13245467D01*
Y13165492D01*
X13836441Y13145499D01*
X13796454D01*
X13776460Y13165492D01*
Y13245467D01*
X13736475Y11875500D02*
X13656500D01*
X13736475Y11955474D01*
Y11975468D01*
X13716479Y11995461D01*
X13676492D01*
X13656500Y11975468D01*
X13856435Y11995461D02*
X13776460D01*
Y11935480D01*
X13816447Y11955474D01*
X13836441D01*
X13856435Y11935480D01*
Y11895493D01*
X13836441Y11875500D01*
X13796454D01*
X13776460Y11895493D01*
X13656500Y10705468D02*
X13676492Y10725461D01*
X13716479D01*
X13736475Y10705468D01*
Y10685474D01*
X13716479Y10665480D01*
X13696487D01*
X13716479D01*
X13736475Y10645487D01*
Y10625493D01*
X13716479Y10605500D01*
X13676492D01*
X13656500Y10625493D01*
X13776460Y10705468D02*
X13796454Y10725461D01*
X13836441D01*
X13856435Y10705468D01*
Y10625493D01*
X13836441Y10605500D01*
X13796454D01*
X13776460Y10625493D01*
Y10705468D01*
X13848975Y17070461D02*
X13769000D01*
Y17010480D01*
X13808987Y17030473D01*
X13828979D01*
X13848975Y17010480D01*
Y16970493D01*
X13828979Y16950500D01*
X13788992D01*
X13769000Y16970493D01*
X13656500Y10197468D02*
X13676492Y10217461D01*
X13716479D01*
X13736475Y10197468D01*
Y10177474D01*
X13716479Y10157480D01*
X13696487D01*
X13716479D01*
X13736475Y10137487D01*
Y10117493D01*
X13716479Y10097500D01*
X13676492D01*
X13656500Y10117493D01*
X13856435Y10097500D02*
X13776460D01*
X13856435Y10177474D01*
Y10197468D01*
X13836441Y10217461D01*
X13796454D01*
X13776460Y10197468D01*
X13676500Y15688000D02*
X13716487D01*
X13696494D01*
Y15807961D01*
X13676500Y15787968D01*
X13776466D02*
X13796461Y15807961D01*
X13836449D01*
X13856442Y15787968D01*
Y15707993D01*
X13836449Y15688000D01*
X13796461D01*
X13776466Y15707993D01*
Y15787968D01*
X14834474Y18407474D02*
X14774493D01*
X14754500Y18387482D01*
Y18347495D01*
X14774493Y18327499D01*
X14834474D01*
X14048894Y18509975D02*
X14088881D01*
X14108875Y18489981D01*
Y18430000D01*
X14048894D01*
X14028900Y18449994D01*
X14048894Y18469987D01*
X14108875D01*
D25*
X20297662Y10072293D02*
Y10077130D01*
X20292825Y10086804D01*
X20287988Y10091641D01*
X20278316Y10096478D01*
X20258966D01*
X20249292Y10091641D01*
X20244455Y10086804D01*
X20239618Y10077130D01*
Y10067456D01*
X20244455Y10057782D01*
X20254129Y10043270D01*
X20302499Y9994900D01*
X20234781D01*
X20280000Y10712130D02*
X20270326Y10716968D01*
X20255815Y10731479D01*
Y10629901D01*
D30*
X47813403Y11161182D02*
G03*
X47813403Y11332018I-106603J85418D01*
G01*
X47826801Y11156600D02*
G03*
X47826801Y11336600I-120000J90000D01*
G01*
X47994351Y11296600D02*
G03*
X48119250Y11296600I62450J-50000D01*
G01*
X48303799Y11286600D02*
G03*
X48323801Y11306600I0J20000D01*
G01*
Y11186600D02*
G03*
X48303799Y11206600I-20000J0D01*
G01*
X47813403Y10811182D02*
G03*
X47813403Y10982017I-106603J85418D01*
G01*
X47826801Y10806600D02*
G03*
X47826801Y10986600I-120000J90000D01*
G01*
X48303799Y10936600D02*
G03*
X48323801Y10956600I0J20000D01*
G01*
Y10836600D02*
G03*
X48303799Y10856600I-20000J0D01*
G01*
X48136801Y10896600D02*
G03*
X48136801Y10896600I-80000J0D01*
G01*
X19130000Y14203799D02*
G03*
X19130000Y14203799I-80000J0D01*
G01*
X18803000Y14163800D02*
G03*
X18783000Y14143800I0J-20000D01*
G01*
Y14263800D02*
G03*
X18803000Y14243800I20000J0D01*
G01*
X19280000Y14293800D02*
G03*
X19280000Y14113800I120000J-90000D01*
G01*
X19293398Y14289218D02*
G03*
X19293398Y14118382I106603J-85418D01*
G01*
X19130000Y14553799D02*
G03*
X19130000Y14553799I-80000J0D01*
G01*
X18803000Y14513800D02*
G03*
X18783000Y14493800I0J-20000D01*
G01*
Y14613800D02*
G03*
X18803000Y14593800I20000J0D01*
G01*
X19280000Y14643800D02*
G03*
X19280000Y14463800I120000J-90000D01*
G01*
X19293398Y14639217D02*
G03*
X19293398Y14468382I106603J-85418D01*
G01*
X19130000Y14903799D02*
G03*
X19130000Y14903799I-80000J0D01*
G01*
X18803000Y14863800D02*
G03*
X18783000Y14843800I0J-20000D01*
G01*
Y14963800D02*
G03*
X18803000Y14943800I20000J0D01*
G01*
X19280000Y14993800D02*
G03*
X19280000Y14813800I120000J-90000D01*
G01*
X19293398Y14989217D02*
G03*
X19293398Y14818382I106603J-85418D01*
G01*
X19130000Y15253799D02*
G03*
X19130000Y15253799I-80000J0D01*
G01*
X18803000Y15213800D02*
G03*
X18783000Y15193800I0J-20000D01*
G01*
Y15313800D02*
G03*
X18803000Y15293800I20000J0D01*
G01*
X19280000Y15343800D02*
G03*
X19280000Y15163800I120000J-90000D01*
G01*
X19293398Y15339217D02*
G03*
X19293398Y15168382I106603J-85418D01*
G01*
X19130000Y15603799D02*
G03*
X19130000Y15603799I-80000J0D01*
G01*
X18803000Y15563800D02*
G03*
X18783000Y15543800I0J-20000D01*
G01*
Y15663800D02*
G03*
X18803000Y15643800I20000J0D01*
G01*
X19280000Y15693800D02*
G03*
X19280000Y15513800I120000J-90000D01*
G01*
X19293398Y15689218D02*
G03*
X19293398Y15518382I106603J-85418D01*
G01*
X19130000Y15953799D02*
G03*
X19130000Y15953799I-80000J0D01*
G01*
X18803000Y15913800D02*
G03*
X18783000Y15893800I0J-20000D01*
G01*
Y16013800D02*
G03*
X18803000Y15993800I20000J0D01*
G01*
X19280000Y16043800D02*
G03*
X19280000Y15863800I120000J-90000D01*
G01*
X19293398Y16039217D02*
G03*
X19293398Y15868382I106603J-85418D01*
G01*
X19130000Y16303799D02*
G03*
X19130000Y16303799I-80000J0D01*
G01*
X18803000Y16263800D02*
G03*
X18783000Y16243800I0J-20000D01*
G01*
Y16363800D02*
G03*
X18803000Y16343800I20000J0D01*
G01*
X19280000Y16393800D02*
G03*
X19280000Y16213800I120000J-90000D01*
G01*
X19293398Y16389217D02*
G03*
X19293398Y16218382I106603J-85418D01*
G01*
X19130000Y16653799D02*
G03*
X19130000Y16653799I-80000J0D01*
G01*
X18803000Y16613800D02*
G03*
X18783000Y16593800I0J-20000D01*
G01*
Y16713800D02*
G03*
X18803000Y16693800I20000J0D01*
G01*
X19280000Y16743800D02*
G03*
X19280000Y16563800I120000J-90000D01*
G01*
X19293398Y16739217D02*
G03*
X19293398Y16568382I106603J-85418D01*
G01*
X19130000Y17703799D02*
G03*
X19130000Y17703799I-80000J0D01*
G01*
X18803000Y17663800D02*
G03*
X18783000Y17643800I0J-20000D01*
G01*
Y17763800D02*
G03*
X18803000Y17743800I20000J0D01*
G01*
X19280000Y17793800D02*
G03*
X19280000Y17613800I120000J-90000D01*
G01*
X19293398Y17789217D02*
G03*
X19293398Y17618382I106603J-85418D01*
G01*
X18803000Y18013800D02*
G03*
X18783000Y17993800I0J-20000D01*
G01*
Y18113800D02*
G03*
X18803000Y18093800I20000J0D01*
G01*
X18987550Y18103799D02*
G03*
X19112450Y18103799I62450J-50000D01*
G01*
X19280000Y18143800D02*
G03*
X19280000Y17963800I120000J-90000D01*
G01*
X19293398Y18139218D02*
G03*
X19293398Y17968382I106603J-85418D01*
G01*
Y17439218D02*
G03*
X19293398Y17268382I106603J-85418D01*
G01*
X19280000Y17443800D02*
G03*
X19280000Y17263800I120000J-90000D01*
G01*
X18987550Y17403799D02*
G03*
X19112450Y17403799I62450J-50000D01*
G01*
X18783000Y17413800D02*
G03*
X18803000Y17393800I20000J0D01*
G01*
Y17313800D02*
G03*
X18783000Y17293800I0J-20000D01*
G01*
X19293398Y17089218D02*
G03*
X19293398Y16918382I106603J-85418D01*
G01*
X19280000Y17093800D02*
G03*
X19280000Y16913800I120000J-90000D01*
G01*
X18783000Y17063800D02*
G03*
X18803000Y17043800I20000J0D01*
G01*
Y16963800D02*
G03*
X18783000Y16943800I0J-20000D01*
G01*
X19130000Y17003799D02*
G03*
X19130000Y17003799I-80000J0D01*
G01*
X16082001Y14178400D02*
G03*
X16082001Y14178400I-80000J0D01*
G01*
X15755000Y14138400D02*
G03*
X15735001Y14118401I0J-20000D01*
G01*
Y14238400D02*
G03*
X15755000Y14218401I20000J0D01*
G01*
X16232001Y14268401D02*
G03*
X16232001Y14088400I120000J-90000D01*
G01*
X16245396Y14263818D02*
G03*
X16245396Y14092982I106603J-85418D01*
G01*
X16082001Y14528400D02*
G03*
X16082001Y14528400I-80000J0D01*
G01*
X15755000Y14488400D02*
G03*
X15735001Y14468401I0J-20000D01*
G01*
Y14588400D02*
G03*
X15755000Y14568401I20000J0D01*
G01*
X16232001Y14618401D02*
G03*
X16232001Y14438400I120000J-90000D01*
G01*
X16245396Y14613817D02*
G03*
X16245396Y14442982I106603J-85418D01*
G01*
X16082001Y14878400D02*
G03*
X16082001Y14878400I-80000J0D01*
G01*
X15755000Y14838400D02*
G03*
X15735001Y14818401I0J-20000D01*
G01*
Y14938400D02*
G03*
X15755000Y14918401I20000J0D01*
G01*
X16232001Y14968401D02*
G03*
X16232001Y14788400I120000J-90000D01*
G01*
X16245396Y14963817D02*
G03*
X16245396Y14792982I106603J-85418D01*
G01*
X16082001Y15228400D02*
G03*
X16082001Y15228400I-80000J0D01*
G01*
X15755000Y15188400D02*
G03*
X15735001Y15168401I0J-20000D01*
G01*
Y15288400D02*
G03*
X15755000Y15268401I20000J0D01*
G01*
X16232001Y15318401D02*
G03*
X16232001Y15138400I120000J-90000D01*
G01*
X16245396Y15313817D02*
G03*
X16245396Y15142982I106603J-85418D01*
G01*
X16082001Y15578400D02*
G03*
X16082001Y15578400I-80000J0D01*
G01*
X15755000Y15538400D02*
G03*
X15735001Y15518401I0J-20000D01*
G01*
Y15638400D02*
G03*
X15755000Y15618401I20000J0D01*
G01*
X16232001Y15668401D02*
G03*
X16232001Y15488400I120000J-90000D01*
G01*
X16245396Y15663818D02*
G03*
X16245396Y15492982I106603J-85418D01*
G01*
X16082001Y15928400D02*
G03*
X16082001Y15928400I-80000J0D01*
G01*
X15755000Y15888400D02*
G03*
X15735001Y15868401I0J-20000D01*
G01*
Y15988400D02*
G03*
X15755000Y15968401I20000J0D01*
G01*
X16232001Y16018401D02*
G03*
X16232001Y15838400I120000J-90000D01*
G01*
X16245396Y16013817D02*
G03*
X16245396Y15842982I106603J-85418D01*
G01*
X16082001Y16278400D02*
G03*
X16082001Y16278400I-80000J0D01*
G01*
X15755000Y16238400D02*
G03*
X15735001Y16218401I0J-20000D01*
G01*
Y16338400D02*
G03*
X15755000Y16318401I20000J0D01*
G01*
X16232001Y16368401D02*
G03*
X16232001Y16188400I120000J-90000D01*
G01*
X16245396Y16363817D02*
G03*
X16245396Y16192982I106603J-85418D01*
G01*
X16082001Y16628400D02*
G03*
X16082001Y16628400I-80000J0D01*
G01*
X15755000Y16588400D02*
G03*
X15735001Y16568401I0J-20000D01*
G01*
Y16688400D02*
G03*
X15755000Y16668401I20000J0D01*
G01*
X16232001Y16718401D02*
G03*
X16232001Y16538400I120000J-90000D01*
G01*
X16245396Y16713817D02*
G03*
X16245396Y16542982I106603J-85418D01*
G01*
X16082001Y17678400D02*
G03*
X16082001Y17678400I-80000J0D01*
G01*
X15755000Y17638400D02*
G03*
X15735001Y17618401I0J-20000D01*
G01*
Y17738400D02*
G03*
X15755000Y17718401I20000J0D01*
G01*
X16232001Y17768401D02*
G03*
X16232001Y17588400I120000J-90000D01*
G01*
X16245396Y17763817D02*
G03*
X16245396Y17592982I106603J-85418D01*
G01*
X15755000Y17988400D02*
G03*
X15735001Y17968401I0J-20000D01*
G01*
Y18088400D02*
G03*
X15755000Y18068401I20000J0D01*
G01*
X15939549Y18078400D02*
G03*
X16064450Y18078400I62450J-50000D01*
G01*
X16232001Y18118401D02*
G03*
X16232001Y17938400I120000J-90000D01*
G01*
X16245396Y18113818D02*
G03*
X16245396Y17942982I106603J-85418D01*
G01*
Y17413818D02*
G03*
X16245396Y17242982I106603J-85418D01*
G01*
X16232001Y17418401D02*
G03*
X16232001Y17238400I120000J-90000D01*
G01*
X15939549Y17378400D02*
G03*
X16064450Y17378400I62450J-50000D01*
G01*
X15735001Y17388400D02*
G03*
X15755000Y17368401I20000J0D01*
G01*
Y17288400D02*
G03*
X15735001Y17268401I0J-20000D01*
G01*
X16245396Y17063818D02*
G03*
X16245396Y16892982I106603J-85418D01*
G01*
X16232001Y17068401D02*
G03*
X16232001Y16888400I120000J-90000D01*
G01*
X15735001Y17038400D02*
G03*
X15755000Y17018401I20000J0D01*
G01*
Y16938400D02*
G03*
X15735001Y16918401I0J-20000D01*
G01*
X16082001Y16978400D02*
G03*
X16082001Y16978400I-80000J0D01*
G01*
X15955000Y10878000D02*
G03*
X15955000Y10878000I-80000J0D01*
G01*
X16122000Y10918000D02*
G03*
X16142000Y10938000I0J20000D01*
G01*
Y10818000D02*
G03*
X16122000Y10838000I-20000J0D01*
G01*
X15645000Y10788000D02*
G03*
X15645000Y10968000I-120000J90000D01*
G01*
X15631602Y10792582D02*
G03*
X15631602Y10963418I-106603J85418D01*
G01*
X16122000Y10568000D02*
G03*
X16142000Y10588000I0J20000D01*
G01*
Y10468000D02*
G03*
X16122000Y10488000I-20000J0D01*
G01*
X15937450Y10478000D02*
G03*
X15812550Y10478000I-62450J50000D01*
G01*
X15645000Y10438000D02*
G03*
X15645000Y10618000I-120000J90000D01*
G01*
X15631602Y10442582D02*
G03*
X15631602Y10613417I-106603J85418D01*
G01*
Y9742582D02*
G03*
X15631602Y9913418I-106603J85418D01*
G01*
X15645000Y9738000D02*
G03*
X15645000Y9918000I-120000J90000D01*
G01*
X15937450Y9778000D02*
G03*
X15812550Y9778000I-62450J50000D01*
G01*
X16142000Y9768000D02*
G03*
X16122000Y9788000I-20000J0D01*
G01*
Y9868000D02*
G03*
X16142000Y9888000I0J20000D01*
G01*
X15631602Y10092583D02*
G03*
X15631602Y10263418I-106603J85418D01*
G01*
X15645000Y10088000D02*
G03*
X15645000Y10268000I-120000J90000D01*
G01*
X16142000Y10118000D02*
G03*
X16122000Y10138000I-20000J0D01*
G01*
Y10218000D02*
G03*
X16142000Y10238000I0J20000D01*
G01*
X15955000Y10178000D02*
G03*
X15955000Y10178000I-80000J0D01*
G01*
X15631602Y11142582D02*
G03*
X15631602Y11313418I-106603J85418D01*
G01*
X15645000Y11138000D02*
G03*
X15645000Y11318000I-120000J90000D01*
G01*
X16142000Y11168000D02*
G03*
X16122000Y11188000I-20000J0D01*
G01*
Y11268000D02*
G03*
X16142000Y11288000I0J20000D01*
G01*
X15955000Y11228000D02*
G03*
X15955000Y11228000I-80000J0D01*
G01*
X15631602Y11492583D02*
G03*
X15631602Y11663418I-106603J85418D01*
G01*
X15645000Y11488000D02*
G03*
X15645000Y11668000I-120000J90000D01*
G01*
X16142000Y11518000D02*
G03*
X16122000Y11538000I-20000J0D01*
G01*
Y11618000D02*
G03*
X16142000Y11638000I0J20000D01*
G01*
X15955000Y11578000D02*
G03*
X15955000Y11578000I-80000J0D01*
G01*
X15631602Y11842583D02*
G03*
X15631602Y12013418I-106603J85418D01*
G01*
X15645000Y11838000D02*
G03*
X15645000Y12018000I-120000J90000D01*
G01*
X16142000Y11868000D02*
G03*
X16122000Y11888000I-20000J0D01*
G01*
Y11968000D02*
G03*
X16142000Y11988000I0J20000D01*
G01*
X15955000Y11928000D02*
G03*
X15955000Y11928000I-80000J0D01*
G01*
X15631602Y12192582D02*
G03*
X15631602Y12363418I-106603J85418D01*
G01*
X15645000Y12188000D02*
G03*
X15645000Y12368000I-120000J90000D01*
G01*
X16142000Y12218000D02*
G03*
X16122000Y12238000I-20000J0D01*
G01*
Y12318000D02*
G03*
X16142000Y12338000I0J20000D01*
G01*
X15955000Y12278000D02*
G03*
X15955000Y12278000I-80000J0D01*
G01*
X10911397Y13166418D02*
G03*
X10911397Y12995583I106603J-85418D01*
G01*
X10898000Y13171001D02*
G03*
X10898000Y12991000I120000J-90000D01*
G01*
X10605550Y13131000D02*
G03*
X10730450Y13131000I62450J-50000D01*
G01*
X10401000Y13141000D02*
G03*
X10421000Y13121001I20000J0D01*
G01*
Y13041000D02*
G03*
X10401000Y13021001I0J-20000D01*
G01*
X10911397Y12816418D02*
G03*
X10911397Y12645582I106603J-85418D01*
G01*
X10898000Y12821001D02*
G03*
X10898000Y12641000I120000J-90000D01*
G01*
X10401000Y12791000D02*
G03*
X10421000Y12771000I20000J0D01*
G01*
Y12691000D02*
G03*
X10401000Y12671000I0J-20000D01*
G01*
X10748000Y12731000D02*
G03*
X10748000Y12731000I-80000J0D01*
G01*
X12399000Y16984000D02*
G03*
X12399000Y16984000I-80000J0D01*
G01*
X12072000Y16944000D02*
G03*
X12052000Y16924001I0J-20000D01*
G01*
Y17044000D02*
G03*
X12072000Y17024001I20000J0D01*
G01*
X12549000Y17074001D02*
G03*
X12549000Y16894000I120000J-90000D01*
G01*
X12562397Y17069417D02*
G03*
X12562397Y16898582I106603J-85418D01*
G01*
X12072000Y17294000D02*
G03*
X12052000Y17274001I0J-20000D01*
G01*
Y17394000D02*
G03*
X12072000Y17374001I20000J0D01*
G01*
X12256550Y17384000D02*
G03*
X12381450Y17384000I62450J-50000D01*
G01*
X12549000Y17424001D02*
G03*
X12549000Y17244000I120000J-90000D01*
G01*
X12562397Y17419418D02*
G03*
X12562397Y17248582I106603J-85418D01*
G01*
Y18119418D02*
G03*
X12562397Y17948582I106603J-85418D01*
G01*
X12549000Y18124001D02*
G03*
X12549000Y17944000I120000J-90000D01*
G01*
X12256550Y18084000D02*
G03*
X12381450Y18084000I62450J-50000D01*
G01*
X12052000Y18094000D02*
G03*
X12072000Y18074001I20000J0D01*
G01*
Y17994000D02*
G03*
X12052000Y17974001I0J-20000D01*
G01*
X12562397Y17769417D02*
G03*
X12562397Y17598582I106603J-85418D01*
G01*
X12549000Y17774001D02*
G03*
X12549000Y17594000I120000J-90000D01*
G01*
X12052000Y17744000D02*
G03*
X12072000Y17724001I20000J0D01*
G01*
Y17644000D02*
G03*
X12052000Y17624001I0J-20000D01*
G01*
X12399000Y17684000D02*
G03*
X12399000Y17684000I-80000J0D01*
G01*
X12562397Y16719417D02*
G03*
X12562397Y16548582I106603J-85418D01*
G01*
X12549000Y16724001D02*
G03*
X12549000Y16544000I120000J-90000D01*
G01*
X12052000Y16694000D02*
G03*
X12072000Y16674001I20000J0D01*
G01*
Y16594000D02*
G03*
X12052000Y16574001I0J-20000D01*
G01*
X12399000Y16634000D02*
G03*
X12399000Y16634000I-80000J0D01*
G01*
X12562397Y16369417D02*
G03*
X12562397Y16198582I106603J-85418D01*
G01*
X12549000Y16374001D02*
G03*
X12549000Y16194000I120000J-90000D01*
G01*
X12052000Y16344000D02*
G03*
X12072000Y16324001I20000J0D01*
G01*
Y16244000D02*
G03*
X12052000Y16224001I0J-20000D01*
G01*
X12399000Y16284000D02*
G03*
X12399000Y16284000I-80000J0D01*
G01*
X12562397Y16019417D02*
G03*
X12562397Y15848582I106603J-85418D01*
G01*
X12549000Y16024001D02*
G03*
X12549000Y15844000I120000J-90000D01*
G01*
X12052000Y15994000D02*
G03*
X12072000Y15974001I20000J0D01*
G01*
Y15894000D02*
G03*
X12052000Y15874001I0J-20000D01*
G01*
X12399000Y15934000D02*
G03*
X12399000Y15934000I-80000J0D01*
G01*
X12562397Y15669417D02*
G03*
X12562397Y15498582I106603J-85418D01*
G01*
X12549000Y15674001D02*
G03*
X12549000Y15494000I120000J-90000D01*
G01*
X12052000Y15644000D02*
G03*
X12072000Y15624001I20000J0D01*
G01*
Y15544000D02*
G03*
X12052000Y15524001I0J-20000D01*
G01*
X12399000Y15584000D02*
G03*
X12399000Y15584000I-80000J0D01*
G01*
X10748000Y16984000D02*
G03*
X10748000Y16984000I-80000J0D01*
G01*
X10421000Y16944000D02*
G03*
X10401000Y16924001I0J-20000D01*
G01*
Y17044000D02*
G03*
X10421000Y17024001I20000J0D01*
G01*
X10898000Y17074001D02*
G03*
X10898000Y16894000I120000J-90000D01*
G01*
X10911397Y17069418D02*
G03*
X10911397Y16898582I106603J-85418D01*
G01*
X10421000Y17294000D02*
G03*
X10401000Y17274001I0J-20000D01*
G01*
Y17394000D02*
G03*
X10421000Y17374001I20000J0D01*
G01*
X10605550Y17384001D02*
G03*
X10730450Y17384001I62450J-50000D01*
G01*
X10898000Y17424001D02*
G03*
X10898000Y17244000I120000J-90000D01*
G01*
X10911397Y17419418D02*
G03*
X10911397Y17248582I106603J-85418D01*
G01*
Y18119418D02*
G03*
X10911397Y17948582I106603J-85418D01*
G01*
X10898000Y18124001D02*
G03*
X10898000Y17944000I120000J-90000D01*
G01*
X10605550Y18084000D02*
G03*
X10730450Y18084000I62450J-50000D01*
G01*
X10401000Y18094000D02*
G03*
X10421000Y18074001I20000J0D01*
G01*
Y17994000D02*
G03*
X10401000Y17974001I0J-20000D01*
G01*
X10911397Y17769418D02*
G03*
X10911397Y17598582I106603J-85418D01*
G01*
X10898000Y17774001D02*
G03*
X10898000Y17594000I120000J-90000D01*
G01*
X10401000Y17744000D02*
G03*
X10421000Y17724001I20000J0D01*
G01*
Y17644000D02*
G03*
X10401000Y17624001I0J-20000D01*
G01*
X10748000Y17684000D02*
G03*
X10748000Y17684000I-80000J0D01*
G01*
X10911397Y16719418D02*
G03*
X10911397Y16548582I106603J-85418D01*
G01*
X10898000Y16724001D02*
G03*
X10898000Y16544000I120000J-90000D01*
G01*
X10401000Y16694000D02*
G03*
X10421000Y16674001I20000J0D01*
G01*
Y16594000D02*
G03*
X10401000Y16574001I0J-20000D01*
G01*
X10748000Y16634000D02*
G03*
X10748000Y16634000I-80000J0D01*
G01*
X10911397Y16369418D02*
G03*
X10911397Y16198582I106603J-85418D01*
G01*
X10898000Y16374001D02*
G03*
X10898000Y16194000I120000J-90000D01*
G01*
X10401000Y16344000D02*
G03*
X10421000Y16324001I20000J0D01*
G01*
Y16244000D02*
G03*
X10401000Y16224001I0J-20000D01*
G01*
X10748000Y16284000D02*
G03*
X10748000Y16284000I-80000J0D01*
G01*
X10911397Y16019418D02*
G03*
X10911397Y15848582I106603J-85418D01*
G01*
X10898000Y16024001D02*
G03*
X10898000Y15844000I120000J-90000D01*
G01*
X10401000Y15994000D02*
G03*
X10421000Y15974001I20000J0D01*
G01*
Y15894000D02*
G03*
X10401000Y15874001I0J-20000D01*
G01*
X10748000Y15934000D02*
G03*
X10748000Y15934000I-80000J0D01*
G01*
X10911397Y15669418D02*
G03*
X10911397Y15498582I106603J-85418D01*
G01*
X10898000Y15674001D02*
G03*
X10898000Y15494000I120000J-90000D01*
G01*
X10401000Y15644000D02*
G03*
X10421000Y15624001I20000J0D01*
G01*
Y15544000D02*
G03*
X10401000Y15524001I0J-20000D01*
G01*
X10748000Y15584000D02*
G03*
X10748000Y15584000I-80000J0D01*
G01*
X8494500Y9596995D02*
G03*
X8494500Y9596995I-142500J0D01*
G01*
Y18597000D02*
G03*
X8494500Y18597000I-142500J0D01*
G01*
X7857000Y9456995D02*
G03*
X7957000Y9356995I100000J0D01*
G01*
X8807000Y9356995D02*
G03*
X8907000Y9456995I0J100000D01*
G01*
X7957000Y18837000D02*
G03*
X7857000Y18737000I0J-100000D01*
G01*
X8907000D02*
G03*
X8807000Y18837000I-100000J0D01*
G01*
X19812000Y10953751D02*
G03*
X19812000Y10433050I0J-260350D01*
G01*
Y10991850D02*
G03*
X19812000Y10394951I0J-298449D01*
G01*
Y10318750D02*
G03*
X19812000Y9798050I0J-260350D01*
G01*
Y10356849D02*
G03*
X19812000Y9759951I0J-298449D01*
G01*
X17638499Y9596995D02*
G03*
X17638499Y9596995I-142500J0D01*
G01*
Y18597000D02*
G03*
X17638499Y18597000I-142500J0D01*
G01*
X17000999Y9456995D02*
G03*
X17100999Y9356995I100000J0D01*
G01*
X17950999Y9356995D02*
G03*
X18050999Y9456995I0J100000D01*
G01*
X17100999Y18837000D02*
G03*
X17000999Y18737000I0J-100000D01*
G01*
X18050999D02*
G03*
X17950999Y18837000I-100000J0D01*
G01*
X14590500Y9596995D02*
G03*
X14590500Y9596995I-142500J0D01*
G01*
Y18597000D02*
G03*
X14590500Y18597000I-142500J0D01*
G01*
X13953000Y9456995D02*
G03*
X14053000Y9356995I100000J0D01*
G01*
X14903000Y9356995D02*
G03*
X15003000Y9456995I0J100000D01*
G01*
X14053000Y18837000D02*
G03*
X13953000Y18737000I0J-100000D01*
G01*
X15003000D02*
G03*
X14903000Y18837000I-100000J0D01*
G01*
X8452650Y18597000D02*
G03*
X8452650Y18597000I-100650J0D01*
G01*
X8477000D02*
G03*
X8477000Y18597000I-125000J0D01*
G01*
X8602000D02*
G03*
X8602000Y18597000I-250000J0D01*
G01*
X8452650Y9596995D02*
G03*
X8452650Y9596995I-100650J0D01*
G01*
X8477000D02*
G03*
X8477000Y9596995I-125000J0D01*
G01*
X8602000D02*
G03*
X8602000Y9596995I-250000J0D01*
G01*
X14548650Y18597000D02*
G03*
X14548650Y18597000I-100650J0D01*
G01*
X14573000D02*
G03*
X14573000Y18597000I-125000J0D01*
G01*
X14698000D02*
G03*
X14698000Y18597000I-250000J0D01*
G01*
X14548650Y9597000D02*
G03*
X14548650Y9597000I-100650J0D01*
G01*
X14573000D02*
G03*
X14573000Y9597000I-125000J0D01*
G01*
X14698000D02*
G03*
X14698000Y9597000I-250000J0D01*
G01*
X17596651Y18597005D02*
G03*
X17596651Y18597005I-100650J0D01*
G01*
X17621001D02*
G03*
X17621001Y18597005I-125000J0D01*
G01*
X17746001D02*
G03*
X17746001Y18597005I-250000J0D01*
G01*
X17596651Y9597000D02*
G03*
X17596651Y9597000I-100650J0D01*
G01*
X17621001D02*
G03*
X17621001Y9597000I-125000J0D01*
G01*
X17746001D02*
G03*
X17746001Y9597000I-250000J0D01*
G01*
X8602000Y18596996D02*
G03*
X8602000Y18596996I-250000J0D01*
G01*
X8281007Y18520737D02*
G03*
X8250462Y18573643I-40237J12040D01*
G01*
X8380827Y18499103D02*
G03*
X8321455Y18497385I-28826J-30545D01*
G01*
X8281008Y18520737D02*
G03*
X8321455Y18497385I22993J-6880D01*
G01*
X8380827Y18499103D02*
G03*
X8422993Y18520737I19035J14809D01*
G01*
X8451190Y18573013D02*
G03*
X8422993Y18520737I12040J-40237D01*
G01*
X8454136Y18573793D02*
G03*
X8453538Y18620348I-6136J23202D01*
G01*
X8422364Y18670906D02*
G03*
X8453538Y18620348I40866J-9692D01*
G01*
X8422364Y18670906D02*
G03*
X8382545Y18696606I-22342J9081D01*
G01*
X8323174Y18694888D02*
G03*
X8382545Y18696606I28826J30545D01*
G01*
X8323174Y18694888D02*
G03*
X8281007Y18673254I-19035J-14809D01*
G01*
X8250462Y18620348D02*
G03*
X8281007Y18673254I-9692J40866D01*
G01*
X8250462Y18620348D02*
G03*
X8250462Y18573643I5538J-23352D01*
G01*
X8477000Y18596996D02*
G03*
X8477000Y18596996I-125000J0D01*
G01*
X8591626D02*
G03*
X8591626Y18596996I-239626J0D01*
G01*
X8602000Y9596990D02*
G03*
X8602000Y9596990I-250000J0D01*
G01*
X8281007Y9520732D02*
G03*
X8250462Y9573638I-40237J12040D01*
G01*
X8380827Y9499098D02*
G03*
X8321455Y9497379I-28826J-30545D01*
G01*
X8281008Y9520732D02*
G03*
X8321455Y9497379I22993J-6880D01*
G01*
X8380827Y9499098D02*
G03*
X8422993Y9520732I19035J14809D01*
G01*
X8451190Y9573009D02*
G03*
X8422993Y9520732I12040J-40237D01*
G01*
X8454136Y9573788D02*
G03*
X8453538Y9620342I-6136J23202D01*
G01*
X8422364Y9670901D02*
G03*
X8453538Y9620343I40866J-9692D01*
G01*
X8422364Y9670901D02*
G03*
X8382545Y9696601I-22342J9081D01*
G01*
X8323174Y9694883D02*
G03*
X8382545Y9696601I28826J30545D01*
G01*
X8323174Y9694883D02*
G03*
X8281007Y9673249I-19035J-14809D01*
G01*
X8250462Y9620343D02*
G03*
X8281007Y9673249I-9692J40866D01*
G01*
X8250462Y9620342D02*
G03*
X8250462Y9573638I5538J-23352D01*
G01*
X8477000Y9596990D02*
G03*
X8477000Y9596990I-125000J0D01*
G01*
X8591626D02*
G03*
X8591626Y9596990I-239626J0D01*
G01*
X14698000Y18596996D02*
G03*
X14698000Y18596996I-250000J0D01*
G01*
X14377007Y18520737D02*
G03*
X14346461Y18573643I-40237J12040D01*
G01*
X14476826Y18499103D02*
G03*
X14417455Y18497385I-28826J-30545D01*
G01*
X14377008Y18520737D02*
G03*
X14417455Y18497385I22993J-6880D01*
G01*
X14476826Y18499103D02*
G03*
X14518993Y18520737I19035J14809D01*
G01*
X14547189Y18573013D02*
G03*
X14518993Y18520737I12040J-40237D01*
G01*
X14550136Y18573793D02*
G03*
X14549538Y18620348I-6136J23202D01*
G01*
X14518364Y18670906D02*
G03*
X14549538Y18620348I40866J-9692D01*
G01*
X14518364Y18670906D02*
G03*
X14478545Y18696606I-22342J9081D01*
G01*
X14419174Y18694888D02*
G03*
X14478545Y18696606I28826J30545D01*
G01*
X14419174Y18694888D02*
G03*
X14377007Y18673254I-19035J-14809D01*
G01*
X14346461Y18620348D02*
G03*
X14377007Y18673254I-9692J40866D01*
G01*
X14346461Y18620348D02*
G03*
X14346461Y18573643I5538J-23352D01*
G01*
X14573000Y18596996D02*
G03*
X14573000Y18596996I-125000J0D01*
G01*
X14687627D02*
G03*
X14687627Y18596996I-239626J0D01*
G01*
X14698000Y9596995D02*
G03*
X14698000Y9596995I-250000J0D01*
G01*
X14377007Y9520736D02*
G03*
X14346461Y9573643I-40237J12040D01*
G01*
X14476826Y9499103D02*
G03*
X14417455Y9497384I-28826J-30545D01*
G01*
X14377008Y9520736D02*
G03*
X14417455Y9497384I22993J-6880D01*
G01*
X14476826Y9499103D02*
G03*
X14518993Y9520736I19035J14809D01*
G01*
X14547189Y9573013D02*
G03*
X14518993Y9520736I12040J-40237D01*
G01*
X14550136Y9573793D02*
G03*
X14549538Y9620347I-6136J23202D01*
G01*
X14518364Y9670906D02*
G03*
X14549538Y9620348I40866J-9692D01*
G01*
X14518364Y9670905D02*
G03*
X14478545Y9696606I-22342J9081D01*
G01*
X14419174Y9694887D02*
G03*
X14478545Y9696606I28826J30545D01*
G01*
X14419174Y9694887D02*
G03*
X14377007Y9673254I-19035J-14809D01*
G01*
X14346461Y9620348D02*
G03*
X14377007Y9673254I-9692J40866D01*
G01*
X14346461Y9620347D02*
G03*
X14346461Y9573643I5538J-23352D01*
G01*
X14573000Y9596995D02*
G03*
X14573000Y9596995I-125000J0D01*
G01*
X14687627D02*
G03*
X14687627Y9596995I-239626J0D01*
G01*
X17746001Y18597000D02*
G03*
X17746001Y18597000I-250000J0D01*
G01*
X17425008Y18520741D02*
G03*
X17394463Y18573648I-40237J12040D01*
G01*
X17524828Y18499107D02*
G03*
X17465456Y18497389I-28826J-30545D01*
G01*
X17425008Y18520741D02*
G03*
X17465456Y18497389I22993J-6880D01*
G01*
X17524828Y18499107D02*
G03*
X17566994Y18520741I19035J14809D01*
G01*
X17595190Y18573018D02*
G03*
X17566994Y18520741I12040J-40237D01*
G01*
X17598135Y18573798D02*
G03*
X17597539Y18620352I-6136J23202D01*
G01*
X17566364Y18670911D02*
G03*
X17597539Y18620354I40866J-9692D01*
G01*
X17566364Y18670911D02*
G03*
X17526546Y18696611I-22342J9081D01*
G01*
X17467174Y18694893D02*
G03*
X17526546Y18696611I28826J30545D01*
G01*
X17467174Y18694893D02*
G03*
X17425008Y18673259I-19035J-14809D01*
G01*
X17394463Y18620354D02*
G03*
X17425008Y18673259I-9692J40866D01*
G01*
X17394463Y18620352D02*
G03*
X17394463Y18573648I5538J-23352D01*
G01*
X17621001Y18597000D02*
G03*
X17621001Y18597000I-125000J0D01*
G01*
X17735626D02*
G03*
X17735626Y18597000I-239626J0D01*
G01*
X17746001Y9596995D02*
G03*
X17746001Y9596995I-250000J0D01*
G01*
X17425008Y9520736D02*
G03*
X17394463Y9573643I-40237J12040D01*
G01*
X17524828Y9499103D02*
G03*
X17465456Y9497384I-28826J-30545D01*
G01*
X17425008Y9520736D02*
G03*
X17465456Y9497384I22993J-6880D01*
G01*
X17524828Y9499103D02*
G03*
X17566994Y9520736I19035J14809D01*
G01*
X17595190Y9573013D02*
G03*
X17566994Y9520736I12040J-40237D01*
G01*
X17598135Y9573793D02*
G03*
X17597539Y9620347I-6136J23202D01*
G01*
X17566364Y9670906D02*
G03*
X17597539Y9620348I40866J-9692D01*
G01*
X17566364Y9670905D02*
G03*
X17526546Y9696606I-22342J9081D01*
G01*
X17467174Y9694887D02*
G03*
X17526546Y9696606I28826J30545D01*
G01*
X17467174Y9694887D02*
G03*
X17425008Y9673254I-19035J-14809D01*
G01*
X17394463Y9620348D02*
G03*
X17425008Y9673254I-9692J40866D01*
G01*
X17394463Y9620347D02*
G03*
X17394463Y9573643I5538J-23352D01*
G01*
X17621001Y9596995D02*
G03*
X17621001Y9596995I-125000J0D01*
G01*
X17735626D02*
G03*
X17735626Y9596995I-239626J0D01*
G01*
X8487000Y18597000D02*
G03*
X8487000Y18597000I-135000J0D01*
G01*
X8602000D02*
G03*
X8602000Y18597000I-250000J0D01*
G01*
X8487000Y9596995D02*
G03*
X8487000Y9596995I-135000J0D01*
G01*
X8602000D02*
G03*
X8602000Y9596995I-250000J0D01*
G01*
X14583000Y18597000D02*
G03*
X14583000Y18597000I-135000J0D01*
G01*
X14698000D02*
G03*
X14698000Y18597000I-250000J0D01*
G01*
X14583000Y9597000D02*
G03*
X14583000Y9597000I-135000J0D01*
G01*
X14698000D02*
G03*
X14698000Y9597000I-250000J0D01*
G01*
X17631000Y18597005D02*
G03*
X17631000Y18597005I-135000J0D01*
G01*
X17746001D02*
G03*
X17746001Y18597005I-250000J0D01*
G01*
X17631000Y9597000D02*
G03*
X17631000Y9597000I-135000J0D01*
G01*
X17746001D02*
G03*
X17746001Y9597000I-250000J0D01*
G01*
X48481799Y10206600D02*
Y11936600D01*
X47756799Y10206600D02*
X48481799D01*
X47756799D02*
Y11936600D01*
X48481799D01*
X48391800Y11097600D02*
Y11395600D01*
X48323801Y11121100D02*
X48391800Y11097600D01*
X48323801Y11121100D02*
Y11372100D01*
X48391800Y11395600D01*
X48256799Y11286600D02*
X48303799D01*
X48256799D02*
Y11401600D01*
X48270197Y11286600D02*
Y11401600D01*
X47813403D02*
X48270197D01*
X47813403Y11332017D02*
Y11401600D01*
Y11332017D02*
X47826801Y11336600D01*
Y11401600D01*
X47813403Y11161182D02*
X47826801Y11156600D01*
X47813403Y11091600D02*
Y11161182D01*
Y11091600D02*
X48270197D01*
X47826801D02*
Y11156600D01*
X48270197Y11091600D02*
Y11206600D01*
X48256799Y11091600D02*
Y11206600D01*
X48096799D02*
Y11286600D01*
X48016800Y11206600D02*
X48096799D01*
X48016800D02*
Y11286600D01*
X48096799D01*
X48070801Y11260600D02*
X48096799Y11286600D01*
X48070801Y11232600D02*
Y11260600D01*
Y11232600D02*
X48096799Y11206600D01*
X48016800D02*
X48043594Y11233395D01*
X48016800Y11286600D02*
X48042801Y11260600D01*
X48070801D01*
X48042801Y11232600D02*
Y11260600D01*
Y11232600D02*
X48070786Y11232600D01*
X47994351Y11296600D02*
X48119250D01*
X48256799Y11206600D02*
X48303799D01*
X48391800Y10747600D02*
Y11045600D01*
X48323801Y10771100D02*
X48391800Y10747600D01*
X48323801Y10771100D02*
Y11022100D01*
X48391800Y11045600D01*
X48256799Y10936600D02*
X48303799D01*
X48256799D02*
Y11051600D01*
X48270197Y10936600D02*
Y11051600D01*
X47813403D02*
X48270197D01*
X47813403Y10982017D02*
Y11051600D01*
Y10982017D02*
X47826801Y10986600D01*
Y11051600D01*
X47813403Y10811182D02*
X47826801Y10806600D01*
X47813403Y10741600D02*
Y10811182D01*
Y10741600D02*
X48270197D01*
X47826801D02*
Y10806600D01*
X48270197Y10741600D02*
Y10856600D01*
X48256799Y10741600D02*
Y10856600D01*
X48096799D02*
Y10936600D01*
X48016800Y10856600D02*
X48096799D01*
X48016800D02*
Y10936600D01*
X48096799D01*
X48070801Y10910600D02*
X48096799Y10936600D01*
X48070801Y10882600D02*
Y10910600D01*
Y10882600D02*
X48096799Y10856600D01*
X48016800D02*
X48043594Y10883395D01*
X48016800Y10936600D02*
X48042801Y10910600D01*
X48070801D01*
X48042801Y10882600D02*
Y10910600D01*
Y10882600D02*
X48070786Y10882600D01*
X48256799Y10856600D02*
X48303799D01*
X46548001Y11021600D02*
X47178000D01*
Y10771600D02*
Y11021600D01*
X46548001Y10771600D02*
X47178000D01*
X46548001D02*
Y11021600D01*
X47178000Y10896600D02*
X47257999D01*
X46467999D02*
X46548001D01*
X47178000Y11252200D02*
X47257999D01*
X46467999D02*
X46548001D01*
X47178000Y11127200D02*
Y11377200D01*
X46548001D02*
X47178000D01*
X46548001Y11127200D02*
Y11377200D01*
Y11127200D02*
X47178000D01*
X18803000Y14163800D02*
X18850000D01*
X19036015Y14189799D02*
X19064000Y14189799D01*
Y14217799D01*
X19036000D02*
X19064000D01*
X19089999Y14243800D01*
X19063205Y14190594D02*
X19089999Y14163800D01*
X19010001D02*
X19036000Y14189799D01*
Y14217799D01*
X19010001Y14243800D02*
X19036000Y14217799D01*
X19010001Y14243800D02*
X19089999D01*
Y14163800D02*
Y14243800D01*
X19010001Y14163800D02*
X19089999D01*
X19010001D02*
Y14243800D01*
X18850000Y14048801D02*
Y14163800D01*
X18836601Y14048801D02*
Y14163800D01*
X19280000Y14048801D02*
Y14113800D01*
X18836601Y14048801D02*
X19293398D01*
Y14118382D01*
X19280000Y14113800D02*
X19293398Y14118382D01*
X19280000Y14293800D02*
Y14358800D01*
Y14293800D02*
X19293398Y14289218D01*
Y14358800D01*
X18836601D02*
X19293398D01*
X18836601Y14243800D02*
Y14358800D01*
X18850000Y14243800D02*
Y14358800D01*
X18803000Y14243800D02*
X18850000D01*
X18714999Y14352800D02*
X18783000Y14329300D01*
Y14078300D02*
Y14329300D01*
X18714999Y14054800D02*
X18783000Y14078300D01*
X18714999Y14054800D02*
Y14352800D01*
X18803000Y14513800D02*
X18850000D01*
X19036015Y14539799D02*
X19064000Y14539799D01*
Y14567799D01*
X19036000D02*
X19064000D01*
X19089999Y14593800D01*
X19063205Y14540594D02*
X19089999Y14513800D01*
X19010001D02*
X19036000Y14539799D01*
Y14567799D01*
X19010001Y14593800D02*
X19036000Y14567799D01*
X19010001Y14593800D02*
X19089999D01*
Y14513800D02*
Y14593800D01*
X19010001Y14513800D02*
X19089999D01*
X19010001D02*
Y14593800D01*
X18850000Y14398801D02*
Y14513800D01*
X18836601Y14398801D02*
Y14513800D01*
X19280000Y14398801D02*
Y14463800D01*
X18836601Y14398801D02*
X19293398D01*
Y14468382D01*
X19280000Y14463800D02*
X19293398Y14468382D01*
X19280000Y14643800D02*
Y14708800D01*
Y14643800D02*
X19293398Y14639217D01*
Y14708800D01*
X18836601D02*
X19293398D01*
X18836601Y14593800D02*
Y14708800D01*
X18850000Y14593800D02*
Y14708800D01*
X18803000Y14593800D02*
X18850000D01*
X18714999Y14702800D02*
X18783000Y14679300D01*
Y14428300D02*
Y14679300D01*
X18714999Y14404800D02*
X18783000Y14428300D01*
X18714999Y14404800D02*
Y14702800D01*
X18803000Y14863800D02*
X18850000D01*
X19036015Y14889799D02*
X19064000Y14889799D01*
Y14917799D01*
X19036000D02*
X19064000D01*
X19089999Y14943800D01*
X19063205Y14890594D02*
X19089999Y14863800D01*
X19010001D02*
X19036000Y14889799D01*
Y14917799D01*
X19010001Y14943800D02*
X19036000Y14917799D01*
X19010001Y14943800D02*
X19089999D01*
Y14863800D02*
Y14943800D01*
X19010001Y14863800D02*
X19089999D01*
X19010001D02*
Y14943800D01*
X18850000Y14748801D02*
Y14863800D01*
X18836601Y14748801D02*
Y14863800D01*
X19280000Y14748801D02*
Y14813800D01*
X18836601Y14748801D02*
X19293398D01*
Y14818382D01*
X19280000Y14813800D02*
X19293398Y14818382D01*
X19280000Y14993800D02*
Y15058800D01*
Y14993800D02*
X19293398Y14989217D01*
Y15058800D01*
X18836601D02*
X19293398D01*
X18836601Y14943800D02*
Y15058800D01*
X18850000Y14943800D02*
Y15058800D01*
X18803000Y14943800D02*
X18850000D01*
X18714999Y15052800D02*
X18783000Y15029300D01*
Y14778300D02*
Y15029300D01*
X18714999Y14754800D02*
X18783000Y14778300D01*
X18714999Y14754800D02*
Y15052800D01*
X18803000Y15213800D02*
X18850000D01*
X19036015Y15239799D02*
X19064000Y15239799D01*
Y15267799D01*
X19036000D02*
X19064000D01*
X19089999Y15293800D01*
X19063205Y15240594D02*
X19089999Y15213800D01*
X19010001D02*
X19036000Y15239799D01*
Y15267799D01*
X19010001Y15293800D02*
X19036000Y15267799D01*
X19010001Y15293800D02*
X19089999D01*
Y15213800D02*
Y15293800D01*
X19010001Y15213800D02*
X19089999D01*
X19010001D02*
Y15293800D01*
X18850000Y15098801D02*
Y15213800D01*
X18836601Y15098801D02*
Y15213800D01*
X19280000Y15098801D02*
Y15163800D01*
X18836601Y15098801D02*
X19293398D01*
Y15168382D01*
X19280000Y15163800D02*
X19293398Y15168382D01*
X19280000Y15343800D02*
Y15408800D01*
Y15343800D02*
X19293398Y15339217D01*
Y15408800D01*
X18836601D02*
X19293398D01*
X18836601Y15293800D02*
Y15408800D01*
X18850000Y15293800D02*
Y15408800D01*
X18803000Y15293800D02*
X18850000D01*
X18714999Y15402800D02*
X18783000Y15379300D01*
Y15128300D02*
Y15379300D01*
X18714999Y15104800D02*
X18783000Y15128300D01*
X18714999Y15104800D02*
Y15402800D01*
X18803000Y15563800D02*
X18850000D01*
X19036015Y15589799D02*
X19064000Y15589799D01*
Y15617799D01*
X19036000D02*
X19064000D01*
X19089999Y15643800D01*
X19063205Y15590594D02*
X19089999Y15563800D01*
X19010001D02*
X19036000Y15589799D01*
Y15617799D01*
X19010001Y15643800D02*
X19036000Y15617799D01*
X19010001Y15643800D02*
X19089999D01*
Y15563800D02*
Y15643800D01*
X19010001Y15563800D02*
X19089999D01*
X19010001D02*
Y15643800D01*
X18850000Y15448801D02*
Y15563800D01*
X18836601Y15448801D02*
Y15563800D01*
X19280000Y15448801D02*
Y15513800D01*
X18836601Y15448801D02*
X19293398D01*
Y15518382D01*
X19280000Y15513800D02*
X19293398Y15518382D01*
X19280000Y15693800D02*
Y15758800D01*
Y15693800D02*
X19293398Y15689218D01*
Y15758800D01*
X18836601D02*
X19293398D01*
X18836601Y15643800D02*
Y15758800D01*
X18850000Y15643800D02*
Y15758800D01*
X18803000Y15643800D02*
X18850000D01*
X18714999Y15752800D02*
X18783000Y15729300D01*
Y15478300D02*
Y15729300D01*
X18714999Y15454800D02*
X18783000Y15478300D01*
X18714999Y15454800D02*
Y15752800D01*
X18803000Y15913800D02*
X18850000D01*
X19036015Y15939799D02*
X19064000Y15939799D01*
Y15967799D01*
X19036000D02*
X19064000D01*
X19089999Y15993800D01*
X19063205Y15940594D02*
X19089999Y15913800D01*
X19010001D02*
X19036000Y15939799D01*
Y15967799D01*
X19010001Y15993800D02*
X19036000Y15967799D01*
X19010001Y15993800D02*
X19089999D01*
Y15913800D02*
Y15993800D01*
X19010001Y15913800D02*
X19089999D01*
X19010001D02*
Y15993800D01*
X18850000Y15798801D02*
Y15913800D01*
X18836601Y15798801D02*
Y15913800D01*
X19280000Y15798801D02*
Y15863800D01*
X18836601Y15798801D02*
X19293398D01*
Y15868382D01*
X19280000Y15863800D02*
X19293398Y15868382D01*
X19280000Y16043800D02*
Y16108800D01*
Y16043800D02*
X19293398Y16039217D01*
Y16108800D01*
X18836601D02*
X19293398D01*
X18836601Y15993800D02*
Y16108800D01*
X18850000Y15993800D02*
Y16108800D01*
X18803000Y15993800D02*
X18850000D01*
X18714999Y16102800D02*
X18783000Y16079300D01*
Y15828300D02*
Y16079300D01*
X18714999Y15804800D02*
X18783000Y15828300D01*
X18714999Y15804800D02*
Y16102800D01*
X18803000Y16263800D02*
X18850000D01*
X19036015Y16289799D02*
X19064000Y16289799D01*
Y16317799D01*
X19036000D02*
X19064000D01*
X19089999Y16343800D01*
X19063205Y16290594D02*
X19089999Y16263800D01*
X19010001D02*
X19036000Y16289799D01*
Y16317799D01*
X19010001Y16343800D02*
X19036000Y16317799D01*
X19010001Y16343800D02*
X19089999D01*
Y16263800D02*
Y16343800D01*
X19010001Y16263800D02*
X19089999D01*
X19010001D02*
Y16343800D01*
X18850000Y16148801D02*
Y16263800D01*
X18836601Y16148801D02*
Y16263800D01*
X19280000Y16148801D02*
Y16213800D01*
X18836601Y16148801D02*
X19293398D01*
Y16218382D01*
X19280000Y16213800D02*
X19293398Y16218382D01*
X19280000Y16393800D02*
Y16458800D01*
Y16393800D02*
X19293398Y16389217D01*
Y16458800D01*
X18836601D02*
X19293398D01*
X18836601Y16343800D02*
Y16458800D01*
X18850000Y16343800D02*
Y16458800D01*
X18803000Y16343800D02*
X18850000D01*
X18714999Y16452800D02*
X18783000Y16429300D01*
Y16178300D02*
Y16429300D01*
X18714999Y16154800D02*
X18783000Y16178300D01*
X18714999Y16154800D02*
Y16452800D01*
X18803000Y16613800D02*
X18850000D01*
X19036015Y16639799D02*
X19064000Y16639799D01*
Y16667799D01*
X19036000D02*
X19064000D01*
X19089999Y16693800D01*
X19063205Y16640594D02*
X19089999Y16613800D01*
X19010001D02*
X19036000Y16639799D01*
Y16667799D01*
X19010001Y16693800D02*
X19036000Y16667799D01*
X19010001Y16693800D02*
X19089999D01*
Y16613800D02*
Y16693800D01*
X19010001Y16613800D02*
X19089999D01*
X19010001D02*
Y16693800D01*
X18850000Y16498801D02*
Y16613800D01*
X18836601Y16498801D02*
Y16613800D01*
X19280000Y16498801D02*
Y16563800D01*
X18836601Y16498801D02*
X19293398D01*
Y16568382D01*
X19280000Y16563800D02*
X19293398Y16568382D01*
X19280000Y16743800D02*
Y16808800D01*
Y16743800D02*
X19293398Y16739217D01*
Y16808800D01*
X18836601D02*
X19293398D01*
X18836601Y16693800D02*
Y16808800D01*
X18850000Y16693800D02*
Y16808800D01*
X18803000Y16693800D02*
X18850000D01*
X18714999Y16802800D02*
X18783000Y16779300D01*
Y16528300D02*
Y16779300D01*
X18714999Y16504800D02*
X18783000Y16528300D01*
X18714999Y16504800D02*
Y16802800D01*
X18803000Y17663800D02*
X18850000D01*
X19036015Y17689799D02*
X19064000Y17689799D01*
Y17717799D01*
X19036000D02*
X19064000D01*
X19089999Y17743800D01*
X19063205Y17690594D02*
X19089999Y17663800D01*
X19010001D02*
X19036000Y17689799D01*
Y17717799D01*
X19010001Y17743800D02*
X19036000Y17717799D01*
X19010001Y17743800D02*
X19089999D01*
Y17663800D02*
Y17743800D01*
X19010001Y17663800D02*
X19089999D01*
X19010001D02*
Y17743800D01*
X18850000Y17548801D02*
Y17663800D01*
X18836601Y17548801D02*
Y17663800D01*
X19280000Y17548801D02*
Y17613800D01*
X18836601Y17548801D02*
X19293398D01*
Y17618382D01*
X19280000Y17613800D02*
X19293398Y17618382D01*
X19280000Y17793800D02*
Y17858800D01*
Y17793800D02*
X19293398Y17789217D01*
Y17858800D01*
X18836601D02*
X19293398D01*
X18836601Y17743800D02*
Y17858800D01*
X18850000Y17743800D02*
Y17858800D01*
X18803000Y17743800D02*
X18850000D01*
X18714999Y17852800D02*
X18783000Y17829300D01*
Y17578300D02*
Y17829300D01*
X18714999Y17554800D02*
X18783000Y17578300D01*
X18714999Y17554800D02*
Y17852800D01*
X18803000Y18013800D02*
X18850000D01*
X18987550Y18103799D02*
X19112450D01*
X19036015Y18039799D02*
X19064000Y18039799D01*
Y18067799D01*
X19036000D02*
X19064000D01*
X19089999Y18093800D01*
X19063205Y18040594D02*
X19089999Y18013800D01*
X19010001D02*
X19036000Y18039799D01*
Y18067799D01*
X19010001Y18093800D02*
X19036000Y18067799D01*
X19010001Y18093800D02*
X19089999D01*
Y18013800D02*
Y18093800D01*
X19010001Y18013800D02*
X19089999D01*
X19010001D02*
Y18093800D01*
X18850000Y17898801D02*
Y18013800D01*
X18836601Y17898801D02*
Y18013800D01*
X19280000Y17898801D02*
Y17963800D01*
X18836601Y17898801D02*
X19293398D01*
Y17968382D01*
X19280000Y17963800D02*
X19293398Y17968382D01*
X19280000Y18143800D02*
Y18208800D01*
Y18143800D02*
X19293398Y18139217D01*
Y18208800D01*
X18836601D02*
X19293398D01*
X18836601Y18093800D02*
Y18208800D01*
X18850000Y18093800D02*
Y18208800D01*
X18803000Y18093800D02*
X18850000D01*
X18714999Y18202800D02*
X18783000Y18179300D01*
Y17928300D02*
Y18179300D01*
X18714999Y17904800D02*
X18783000Y17928300D01*
X18714999Y17904800D02*
Y18202800D01*
X18625000Y18743800D02*
X19350000D01*
Y13513800D02*
Y18743800D01*
X18625000Y13513800D02*
X19350000D01*
X18625000D02*
Y18743800D01*
X18714999Y17204800D02*
Y17502800D01*
Y17204800D02*
X18783000Y17228300D01*
Y17479300D01*
X18714999Y17502800D02*
X18783000Y17479300D01*
X18803000Y17393800D02*
X18850000D01*
Y17508800D01*
X18836601Y17393800D02*
Y17508800D01*
X19293398D01*
Y17439218D02*
Y17508800D01*
X19280000Y17443800D02*
X19293398Y17439218D01*
X19280000Y17443800D02*
Y17508800D01*
Y17263800D02*
X19293398Y17268382D01*
Y17198801D02*
Y17268382D01*
X18836601Y17198801D02*
X19293398D01*
X19280000D02*
Y17263800D01*
X18836601Y17198801D02*
Y17313800D01*
X18850000Y17198801D02*
Y17313800D01*
X19010001D02*
Y17393800D01*
Y17313800D02*
X19089999D01*
Y17393800D01*
X19010001D02*
X19089999D01*
X19010001D02*
X19036000Y17367799D01*
Y17339799D02*
Y17367799D01*
X19010001Y17313800D02*
X19036000Y17339799D01*
X19063205Y17340594D02*
X19089999Y17313800D01*
X19064000Y17367799D02*
X19089999Y17393800D01*
X19036000Y17367799D02*
X19064000D01*
Y17339799D02*
Y17367799D01*
X19036015Y17339799D02*
X19064000Y17339799D01*
X18987550Y17403799D02*
X19112450D01*
X18803000Y17313800D02*
X18850000D01*
X18714999Y16854800D02*
Y17152800D01*
Y16854800D02*
X18783000Y16878300D01*
Y17129300D01*
X18714999Y17152800D02*
X18783000Y17129300D01*
X18803000Y17043800D02*
X18850000D01*
Y17158800D01*
X18836601Y17043800D02*
Y17158800D01*
X19293398D01*
Y17089218D02*
Y17158800D01*
X19280000Y17093800D02*
X19293398Y17089218D01*
X19280000Y17093800D02*
Y17158800D01*
Y16913800D02*
X19293398Y16918382D01*
Y16848801D02*
Y16918382D01*
X18836601Y16848801D02*
X19293398D01*
X19280000D02*
Y16913800D01*
X18836601Y16848801D02*
Y16963800D01*
X18850000Y16848801D02*
Y16963800D01*
X19010001D02*
Y17043800D01*
Y16963800D02*
X19089999D01*
Y17043800D01*
X19010001D02*
X19089999D01*
X19010001D02*
X19036000Y17017799D01*
Y16989799D02*
Y17017799D01*
X19010001Y16963800D02*
X19036000Y16989799D01*
X19063205Y16990594D02*
X19089999Y16963800D01*
X19064000Y17017799D02*
X19089999Y17043800D01*
X19036000Y17017799D02*
X19064000D01*
Y16989799D02*
Y17017799D01*
X19036015Y16989799D02*
X19064000Y16989799D01*
X18803000Y16963800D02*
X18850000D01*
X15755000Y14138400D02*
X15802000D01*
X15988016Y14164400D02*
X16016000Y14164400D01*
Y14192400D01*
X15988000D02*
X16016000D01*
X16042000Y14218401D01*
X16015205Y14165195D02*
X16042000Y14138400D01*
X15962000D02*
X15988000Y14164400D01*
Y14192400D01*
X15962000Y14218401D02*
X15988000Y14192400D01*
X15962000Y14218401D02*
X16042000D01*
Y14138400D02*
Y14218401D01*
X15962000Y14138400D02*
X16042000D01*
X15962000D02*
Y14218401D01*
X15802000Y14023399D02*
Y14138400D01*
X15788602Y14023399D02*
Y14138400D01*
X16232001Y14023399D02*
Y14088400D01*
X15788602Y14023399D02*
X16245398D01*
Y14092982D01*
X16232001Y14088400D02*
X16245398Y14092982D01*
X16232001Y14268401D02*
Y14333400D01*
Y14268401D02*
X16245398Y14263818D01*
Y14333400D01*
X15788602D02*
X16245398D01*
X15788602Y14218401D02*
Y14333400D01*
X15802000Y14218401D02*
Y14333400D01*
X15755000Y14218401D02*
X15802000D01*
X15667000Y14327400D02*
X15735001Y14303900D01*
Y14052901D02*
Y14303900D01*
X15667000Y14029401D02*
X15735001Y14052901D01*
X15667000Y14029401D02*
Y14327400D01*
X15755000Y14488400D02*
X15802000D01*
X15988016Y14514400D02*
X16016000Y14514400D01*
Y14542400D01*
X15988000D02*
X16016000D01*
X16042000Y14568401D01*
X16015205Y14515195D02*
X16042000Y14488400D01*
X15962000D02*
X15988000Y14514400D01*
Y14542400D01*
X15962000Y14568401D02*
X15988000Y14542400D01*
X15962000Y14568401D02*
X16042000D01*
Y14488400D02*
Y14568401D01*
X15962000Y14488400D02*
X16042000D01*
X15962000D02*
Y14568401D01*
X15802000Y14373399D02*
Y14488400D01*
X15788602Y14373399D02*
Y14488400D01*
X16232001Y14373399D02*
Y14438400D01*
X15788602Y14373399D02*
X16245398D01*
Y14442982D01*
X16232001Y14438400D02*
X16245398Y14442982D01*
X16232001Y14618401D02*
Y14683400D01*
Y14618401D02*
X16245398Y14613817D01*
Y14683400D01*
X15788602D02*
X16245398D01*
X15788602Y14568401D02*
Y14683400D01*
X15802000Y14568401D02*
Y14683400D01*
X15755000Y14568401D02*
X15802000D01*
X15667000Y14677400D02*
X15735001Y14653900D01*
Y14402901D02*
Y14653900D01*
X15667000Y14379401D02*
X15735001Y14402901D01*
X15667000Y14379401D02*
Y14677400D01*
X15755000Y14838400D02*
X15802000D01*
X15988016Y14864400D02*
X16016000Y14864400D01*
Y14892400D01*
X15988000D02*
X16016000D01*
X16042000Y14918401D01*
X16015205Y14865195D02*
X16042000Y14838400D01*
X15962000D02*
X15988000Y14864400D01*
Y14892400D01*
X15962000Y14918401D02*
X15988000Y14892400D01*
X15962000Y14918401D02*
X16042000D01*
Y14838400D02*
Y14918401D01*
X15962000Y14838400D02*
X16042000D01*
X15962000D02*
Y14918401D01*
X15802000Y14723399D02*
Y14838400D01*
X15788602Y14723399D02*
Y14838400D01*
X16232001Y14723399D02*
Y14788400D01*
X15788602Y14723399D02*
X16245398D01*
Y14792982D01*
X16232001Y14788400D02*
X16245398Y14792982D01*
X16232001Y14968401D02*
Y15033400D01*
Y14968401D02*
X16245398Y14963817D01*
Y15033400D01*
X15788602D02*
X16245398D01*
X15788602Y14918401D02*
Y15033400D01*
X15802000Y14918401D02*
Y15033400D01*
X15755000Y14918401D02*
X15802000D01*
X15667000Y15027400D02*
X15735001Y15003900D01*
Y14752901D02*
Y15003900D01*
X15667000Y14729401D02*
X15735001Y14752901D01*
X15667000Y14729401D02*
Y15027400D01*
X15755000Y15188400D02*
X15802000D01*
X15988016Y15214400D02*
X16016000Y15214400D01*
Y15242400D01*
X15988000D02*
X16016000D01*
X16042000Y15268401D01*
X16015205Y15215195D02*
X16042000Y15188400D01*
X15962000D02*
X15988000Y15214400D01*
Y15242400D01*
X15962000Y15268401D02*
X15988000Y15242400D01*
X15962000Y15268401D02*
X16042000D01*
Y15188400D02*
Y15268401D01*
X15962000Y15188400D02*
X16042000D01*
X15962000D02*
Y15268401D01*
X15802000Y15073399D02*
Y15188400D01*
X15788602Y15073399D02*
Y15188400D01*
X16232001Y15073399D02*
Y15138400D01*
X15788602Y15073399D02*
X16245398D01*
Y15142982D01*
X16232001Y15138400D02*
X16245398Y15142982D01*
X16232001Y15318401D02*
Y15383400D01*
Y15318401D02*
X16245398Y15313817D01*
Y15383400D01*
X15788602D02*
X16245398D01*
X15788602Y15268401D02*
Y15383400D01*
X15802000Y15268401D02*
Y15383400D01*
X15755000Y15268401D02*
X15802000D01*
X15667000Y15377400D02*
X15735001Y15353900D01*
Y15102901D02*
Y15353900D01*
X15667000Y15079401D02*
X15735001Y15102901D01*
X15667000Y15079401D02*
Y15377400D01*
X15755000Y15538400D02*
X15802000D01*
X15988016Y15564400D02*
X16016000Y15564400D01*
Y15592400D01*
X15988000D02*
X16016000D01*
X16042000Y15618401D01*
X16015205Y15565195D02*
X16042000Y15538400D01*
X15962000D02*
X15988000Y15564400D01*
Y15592400D01*
X15962000Y15618401D02*
X15988000Y15592400D01*
X15962000Y15618401D02*
X16042000D01*
Y15538400D02*
Y15618401D01*
X15962000Y15538400D02*
X16042000D01*
X15962000D02*
Y15618401D01*
X15802000Y15423399D02*
Y15538400D01*
X15788602Y15423399D02*
Y15538400D01*
X16232001Y15423399D02*
Y15488400D01*
X15788602Y15423399D02*
X16245398D01*
Y15492982D01*
X16232001Y15488400D02*
X16245398Y15492982D01*
X16232001Y15668401D02*
Y15733400D01*
Y15668401D02*
X16245398Y15663818D01*
Y15733400D01*
X15788602D02*
X16245398D01*
X15788602Y15618401D02*
Y15733400D01*
X15802000Y15618401D02*
Y15733400D01*
X15755000Y15618401D02*
X15802000D01*
X15667000Y15727400D02*
X15735001Y15703900D01*
Y15452901D02*
Y15703900D01*
X15667000Y15429401D02*
X15735001Y15452901D01*
X15667000Y15429401D02*
Y15727400D01*
X15755000Y15888400D02*
X15802000D01*
X15988016Y15914400D02*
X16016000Y15914400D01*
Y15942400D01*
X15988000D02*
X16016000D01*
X16042000Y15968401D01*
X16015205Y15915195D02*
X16042000Y15888400D01*
X15962000D02*
X15988000Y15914400D01*
Y15942400D01*
X15962000Y15968401D02*
X15988000Y15942400D01*
X15962000Y15968401D02*
X16042000D01*
Y15888400D02*
Y15968401D01*
X15962000Y15888400D02*
X16042000D01*
X15962000D02*
Y15968401D01*
X15802000Y15773399D02*
Y15888400D01*
X15788602Y15773399D02*
Y15888400D01*
X16232001Y15773399D02*
Y15838400D01*
X15788602Y15773399D02*
X16245398D01*
Y15842982D01*
X16232001Y15838400D02*
X16245398Y15842982D01*
X16232001Y16018401D02*
Y16083400D01*
Y16018401D02*
X16245398Y16013817D01*
Y16083400D01*
X15788602D02*
X16245398D01*
X15788602Y15968401D02*
Y16083400D01*
X15802000Y15968401D02*
Y16083400D01*
X15755000Y15968401D02*
X15802000D01*
X15667000Y16077400D02*
X15735001Y16053900D01*
Y15802901D02*
Y16053900D01*
X15667000Y15779401D02*
X15735001Y15802901D01*
X15667000Y15779401D02*
Y16077400D01*
X15755000Y16238400D02*
X15802000D01*
X15988016Y16264400D02*
X16016000Y16264400D01*
Y16292400D01*
X15988000D02*
X16016000D01*
X16042000Y16318401D01*
X16015205Y16265195D02*
X16042000Y16238400D01*
X15962000D02*
X15988000Y16264400D01*
Y16292400D01*
X15962000Y16318401D02*
X15988000Y16292400D01*
X15962000Y16318401D02*
X16042000D01*
Y16238400D02*
Y16318401D01*
X15962000Y16238400D02*
X16042000D01*
X15962000D02*
Y16318401D01*
X15802000Y16123399D02*
Y16238400D01*
X15788602Y16123399D02*
Y16238400D01*
X16232001Y16123399D02*
Y16188400D01*
X15788602Y16123399D02*
X16245398D01*
Y16192982D01*
X16232001Y16188400D02*
X16245398Y16192982D01*
X16232001Y16368401D02*
Y16433400D01*
Y16368401D02*
X16245398Y16363817D01*
Y16433400D01*
X15788602D02*
X16245398D01*
X15788602Y16318401D02*
Y16433400D01*
X15802000Y16318401D02*
Y16433400D01*
X15755000Y16318401D02*
X15802000D01*
X15667000Y16427400D02*
X15735001Y16403900D01*
Y16152901D02*
Y16403900D01*
X15667000Y16129401D02*
X15735001Y16152901D01*
X15667000Y16129401D02*
Y16427400D01*
X15755000Y16588400D02*
X15802000D01*
X15988016Y16614400D02*
X16016000Y16614400D01*
Y16642400D01*
X15988000D02*
X16016000D01*
X16042000Y16668401D01*
X16015205Y16615195D02*
X16042000Y16588400D01*
X15962000D02*
X15988000Y16614400D01*
Y16642400D01*
X15962000Y16668401D02*
X15988000Y16642400D01*
X15962000Y16668401D02*
X16042000D01*
Y16588400D02*
Y16668401D01*
X15962000Y16588400D02*
X16042000D01*
X15962000D02*
Y16668401D01*
X15802000Y16473399D02*
Y16588400D01*
X15788602Y16473399D02*
Y16588400D01*
X16232001Y16473399D02*
Y16538400D01*
X15788602Y16473399D02*
X16245398D01*
Y16542982D01*
X16232001Y16538400D02*
X16245398Y16542982D01*
X16232001Y16718401D02*
Y16783400D01*
Y16718401D02*
X16245398Y16713817D01*
Y16783400D01*
X15788602D02*
X16245398D01*
X15788602Y16668401D02*
Y16783400D01*
X15802000Y16668401D02*
Y16783400D01*
X15755000Y16668401D02*
X15802000D01*
X15667000Y16777400D02*
X15735001Y16753900D01*
Y16502901D02*
Y16753900D01*
X15667000Y16479401D02*
X15735001Y16502901D01*
X15667000Y16479401D02*
Y16777400D01*
X15755000Y17638400D02*
X15802000D01*
X15988016Y17664400D02*
X16016000Y17664400D01*
Y17692400D01*
X15988000D02*
X16016000D01*
X16042000Y17718401D01*
X16015205Y17665195D02*
X16042000Y17638400D01*
X15962000D02*
X15988000Y17664400D01*
Y17692400D01*
X15962000Y17718401D02*
X15988000Y17692400D01*
X15962000Y17718401D02*
X16042000D01*
Y17638400D02*
Y17718401D01*
X15962000Y17638400D02*
X16042000D01*
X15962000D02*
Y17718401D01*
X15802000Y17523399D02*
Y17638400D01*
X15788602Y17523399D02*
Y17638400D01*
X16232001Y17523399D02*
Y17588400D01*
X15788602Y17523399D02*
X16245398D01*
Y17592982D01*
X16232001Y17588400D02*
X16245398Y17592982D01*
X16232001Y17768401D02*
Y17833400D01*
Y17768401D02*
X16245398Y17763817D01*
Y17833400D01*
X15788602D02*
X16245398D01*
X15788602Y17718401D02*
Y17833400D01*
X15802000Y17718401D02*
Y17833400D01*
X15755000Y17718401D02*
X15802000D01*
X15667000Y17827400D02*
X15735001Y17803900D01*
Y17552901D02*
Y17803900D01*
X15667000Y17529401D02*
X15735001Y17552901D01*
X15667000Y17529401D02*
Y17827400D01*
X15755000Y17988400D02*
X15802000D01*
X15939549Y18078400D02*
X16064450D01*
X15988016Y18014400D02*
X16016000Y18014400D01*
Y18042400D01*
X15988000D02*
X16016000D01*
X16042000Y18068401D01*
X16015205Y18015195D02*
X16042000Y17988400D01*
X15962000D02*
X15988000Y18014400D01*
Y18042400D01*
X15962000Y18068401D02*
X15988000Y18042400D01*
X15962000Y18068401D02*
X16042000D01*
Y17988400D02*
Y18068401D01*
X15962000Y17988400D02*
X16042000D01*
X15962000D02*
Y18068401D01*
X15802000Y17873399D02*
Y17988400D01*
X15788602Y17873399D02*
Y17988400D01*
X16232001Y17873399D02*
Y17938400D01*
X15788602Y17873399D02*
X16245398D01*
Y17942982D01*
X16232001Y17938400D02*
X16245398Y17942982D01*
X16232001Y18118401D02*
Y18183400D01*
Y18118401D02*
X16245398Y18113817D01*
Y18183400D01*
X15788602D02*
X16245398D01*
X15788602Y18068401D02*
Y18183400D01*
X15802000Y18068401D02*
Y18183400D01*
X15755000Y18068401D02*
X15802000D01*
X15667000Y18177400D02*
X15735001Y18153900D01*
Y17902901D02*
Y18153900D01*
X15667000Y17879401D02*
X15735001Y17902901D01*
X15667000Y17879401D02*
Y18177400D01*
X15577000Y18718401D02*
X16302000D01*
Y13488400D02*
Y18718401D01*
X15577000Y13488400D02*
X16302000D01*
X15577000D02*
Y18718401D01*
X15667000Y17179401D02*
Y17477400D01*
Y17179401D02*
X15735001Y17202901D01*
Y17453900D01*
X15667000Y17477400D02*
X15735001Y17453900D01*
X15755000Y17368401D02*
X15802000D01*
Y17483400D01*
X15788602Y17368401D02*
Y17483400D01*
X16245398D01*
Y17413818D02*
Y17483400D01*
X16232001Y17418401D02*
X16245398Y17413818D01*
X16232001Y17418401D02*
Y17483400D01*
Y17238400D02*
X16245398Y17242982D01*
Y17173399D02*
Y17242982D01*
X15788602Y17173399D02*
X16245398D01*
X16232001D02*
Y17238400D01*
X15788602Y17173399D02*
Y17288400D01*
X15802000Y17173399D02*
Y17288400D01*
X15962000D02*
Y17368401D01*
Y17288400D02*
X16042000D01*
Y17368401D01*
X15962000D02*
X16042000D01*
X15962000D02*
X15988000Y17342400D01*
Y17314400D02*
Y17342400D01*
X15962000Y17288400D02*
X15988000Y17314400D01*
X16015205Y17315195D02*
X16042000Y17288400D01*
X16016000Y17342400D02*
X16042000Y17368401D01*
X15988000Y17342400D02*
X16016000D01*
Y17314400D02*
Y17342400D01*
X15988016Y17314400D02*
X16016000Y17314400D01*
X15939549Y17378400D02*
X16064450D01*
X15755000Y17288400D02*
X15802000D01*
X15667000Y16829401D02*
Y17127400D01*
Y16829401D02*
X15735001Y16852901D01*
Y17103900D01*
X15667000Y17127400D02*
X15735001Y17103900D01*
X15755000Y17018401D02*
X15802000D01*
Y17133400D01*
X15788602Y17018401D02*
Y17133400D01*
X16245398D01*
Y17063818D02*
Y17133400D01*
X16232001Y17068401D02*
X16245398Y17063818D01*
X16232001Y17068401D02*
Y17133400D01*
Y16888400D02*
X16245398Y16892982D01*
Y16823399D02*
Y16892982D01*
X15788602Y16823399D02*
X16245398D01*
X16232001D02*
Y16888400D01*
X15788602Y16823399D02*
Y16938400D01*
X15802000Y16823399D02*
Y16938400D01*
X15962000D02*
Y17018401D01*
Y16938400D02*
X16042000D01*
Y17018401D01*
X15962000D02*
X16042000D01*
X15962000D02*
X15988000Y16992400D01*
Y16964400D02*
Y16992400D01*
X15962000Y16938400D02*
X15988000Y16964400D01*
X16015205Y16965195D02*
X16042000Y16938400D01*
X16016000Y16992400D02*
X16042000Y17018401D01*
X15988000Y16992400D02*
X16016000D01*
Y16964400D02*
Y16992400D01*
X15988016Y16964400D02*
X16016000Y16964400D01*
X15755000Y16938400D02*
X15802000D01*
X16075000Y10918000D02*
X16122000D01*
X15861000Y10892000D02*
X15888985Y10892000D01*
X15861000Y10864000D02*
Y10892000D01*
Y10864000D02*
X15889000D01*
X15835001Y10838000D02*
X15861000Y10864000D01*
X15835001Y10918000D02*
X15861795Y10891205D01*
X15889000Y10892000D02*
X15914999Y10918000D01*
X15889000Y10864000D02*
Y10892000D01*
Y10864000D02*
X15914999Y10838000D01*
X15835001D02*
X15914999D01*
X15835001D02*
Y10918000D01*
X15914999D01*
Y10838000D02*
Y10918000D01*
X16075000D02*
Y11033000D01*
X16088399Y10918000D02*
Y11033000D01*
X15645000Y10968000D02*
Y11033000D01*
X15631602D02*
X16088399D01*
X15631602Y10963417D02*
Y11033000D01*
Y10963417D02*
X15645000Y10968000D01*
Y10723000D02*
Y10788000D01*
X15631602Y10792582D02*
X15645000Y10788000D01*
X15631602Y10723000D02*
Y10792582D01*
Y10723000D02*
X16088399D01*
Y10838000D01*
X16075000Y10723000D02*
Y10838000D01*
X16122000D01*
X16142000Y10752500D02*
X16210001Y10729000D01*
X16142000Y10752500D02*
Y11003500D01*
X16210001Y11027000D01*
Y10729000D02*
Y11027000D01*
X16075000Y10568000D02*
X16122000D01*
X15812550Y10478000D02*
X15937450D01*
X15861000Y10542000D02*
X15888985Y10541999D01*
X15861000Y10514000D02*
Y10542000D01*
Y10514000D02*
X15889000D01*
X15835001Y10488000D02*
X15861000Y10514000D01*
X15835001Y10568000D02*
X15861795Y10541205D01*
X15889000Y10542000D02*
X15914999Y10568000D01*
X15889000Y10514000D02*
Y10542000D01*
Y10514000D02*
X15914999Y10488000D01*
X15835001D02*
X15914999D01*
X15835001D02*
Y10568000D01*
X15914999D01*
Y10488000D02*
Y10568000D01*
X16075000D02*
Y10683000D01*
X16088399Y10568000D02*
Y10683000D01*
X15645000Y10618000D02*
Y10683000D01*
X15631602D02*
X16088399D01*
X15631602Y10613417D02*
Y10683000D01*
Y10613417D02*
X15645000Y10618000D01*
Y10373000D02*
Y10438000D01*
X15631602Y10442582D02*
X15645000Y10438000D01*
X15631602Y10373000D02*
Y10442582D01*
Y10373000D02*
X16088399D01*
Y10488000D01*
X16075000Y10373000D02*
Y10488000D01*
X16122000D01*
X16142000Y10402500D02*
X16210001Y10379000D01*
X16142000Y10402500D02*
Y10653500D01*
X16210001Y10677000D01*
Y10379000D02*
Y10677000D01*
X16300000Y9138000D02*
Y12967999D01*
X15575000D02*
X16300000D01*
X15575000Y9138000D02*
Y12967999D01*
Y9138000D02*
X16300000D01*
X16210001Y9679000D02*
Y9977000D01*
X16142000Y9953500D02*
X16210001Y9977000D01*
X16142000Y9702500D02*
Y9953500D01*
Y9702500D02*
X16210001Y9679000D01*
X16075000Y9788000D02*
X16122000D01*
X16075000Y9673000D02*
Y9788000D01*
X16088399Y9673000D02*
Y9788000D01*
X15631602Y9673000D02*
X16088399D01*
X15631602D02*
Y9742582D01*
X15645000Y9738000D01*
Y9673000D02*
Y9738000D01*
X15631602Y9913418D02*
X15645000Y9918000D01*
X15631602Y9913418D02*
Y9983000D01*
X16088399D01*
X15645000Y9918000D02*
Y9983000D01*
X16088399Y9868000D02*
Y9983000D01*
X16075000Y9868000D02*
Y9983000D01*
X15914999Y9788000D02*
Y9868000D01*
X15835001D02*
X15914999D01*
X15835001Y9788000D02*
Y9868000D01*
Y9788000D02*
X15914999D01*
X15889000Y9814000D02*
X15914999Y9788000D01*
X15889000Y9814000D02*
Y9842000D01*
X15914999Y9868000D01*
X15835001D02*
X15861795Y9841205D01*
X15835001Y9788000D02*
X15861000Y9814000D01*
X15889000D01*
X15861000D02*
Y9842000D01*
X15888985Y9842000D01*
X15812550Y9778000D02*
X15937450D01*
X16075000Y9868000D02*
X16122000D01*
X16210001Y10029000D02*
Y10327000D01*
X16142000Y10303500D02*
X16210001Y10327000D01*
X16142000Y10052500D02*
Y10303500D01*
Y10052500D02*
X16210001Y10029000D01*
X16075000Y10138000D02*
X16122000D01*
X16075000Y10023000D02*
Y10138000D01*
X16088399Y10023000D02*
Y10138000D01*
X15631602Y10023000D02*
X16088399D01*
X15631602D02*
Y10092583D01*
X15645000Y10088000D01*
Y10023000D02*
Y10088000D01*
X15631602Y10263418D02*
X15645000Y10268000D01*
X15631602Y10263418D02*
Y10333000D01*
X16088399D01*
X15645000Y10268000D02*
Y10333000D01*
X16088399Y10218000D02*
Y10333000D01*
X16075000Y10218000D02*
Y10333000D01*
X15914999Y10138000D02*
Y10218000D01*
X15835001D02*
X15914999D01*
X15835001Y10138000D02*
Y10218000D01*
Y10138000D02*
X15914999D01*
X15889000Y10164000D02*
X15914999Y10138000D01*
X15889000Y10164000D02*
Y10192000D01*
X15914999Y10218000D01*
X15835001D02*
X15861795Y10191205D01*
X15835001Y10138000D02*
X15861000Y10164000D01*
X15889000D01*
X15861000D02*
Y10192000D01*
X15888985Y10192000D01*
X16075000Y10218000D02*
X16122000D01*
X16210001Y11079000D02*
Y11377000D01*
X16142000Y11353500D02*
X16210001Y11377000D01*
X16142000Y11102500D02*
Y11353500D01*
Y11102500D02*
X16210001Y11079000D01*
X16075000Y11188000D02*
X16122000D01*
X16075000Y11073000D02*
Y11188000D01*
X16088399Y11073000D02*
Y11188000D01*
X15631602Y11073000D02*
X16088399D01*
X15631602D02*
Y11142582D01*
X15645000Y11138000D01*
Y11073000D02*
Y11138000D01*
X15631602Y11313418D02*
X15645000Y11318000D01*
X15631602Y11313418D02*
Y11383000D01*
X16088399D01*
X15645000Y11318000D02*
Y11383000D01*
X16088399Y11268000D02*
Y11383000D01*
X16075000Y11268000D02*
Y11383000D01*
X15914999Y11188000D02*
Y11268000D01*
X15835001D02*
X15914999D01*
X15835001Y11188000D02*
Y11268000D01*
Y11188000D02*
X15914999D01*
X15889000Y11214000D02*
X15914999Y11188000D01*
X15889000Y11214000D02*
Y11242000D01*
X15914999Y11268000D01*
X15835001D02*
X15861795Y11241205D01*
X15835001Y11188000D02*
X15861000Y11214000D01*
X15889000D01*
X15861000D02*
Y11242000D01*
X15888985Y11242000D01*
X16075000Y11268000D02*
X16122000D01*
X16210001Y11429000D02*
Y11727000D01*
X16142000Y11703500D02*
X16210001Y11727000D01*
X16142000Y11452500D02*
Y11703500D01*
Y11452500D02*
X16210001Y11429000D01*
X16075000Y11538000D02*
X16122000D01*
X16075000Y11423000D02*
Y11538000D01*
X16088399Y11423000D02*
Y11538000D01*
X15631602Y11423000D02*
X16088399D01*
X15631602D02*
Y11492583D01*
X15645000Y11488000D01*
Y11423000D02*
Y11488000D01*
X15631602Y11663418D02*
X15645000Y11668000D01*
X15631602Y11663418D02*
Y11733000D01*
X16088399D01*
X15645000Y11668000D02*
Y11733000D01*
X16088399Y11618000D02*
Y11733000D01*
X16075000Y11618000D02*
Y11733000D01*
X15914999Y11538000D02*
Y11618000D01*
X15835001D02*
X15914999D01*
X15835001Y11538000D02*
Y11618000D01*
Y11538000D02*
X15914999D01*
X15889000Y11564000D02*
X15914999Y11538000D01*
X15889000Y11564000D02*
Y11592000D01*
X15914999Y11618000D01*
X15835001D02*
X15861795Y11591205D01*
X15835001Y11538000D02*
X15861000Y11564000D01*
X15889000D01*
X15861000D02*
Y11592000D01*
X15888985Y11592000D01*
X16075000Y11618000D02*
X16122000D01*
X16210001Y11779000D02*
Y12077000D01*
X16142000Y12053500D02*
X16210001Y12077000D01*
X16142000Y11802500D02*
Y12053500D01*
Y11802500D02*
X16210001Y11779000D01*
X16075000Y11888000D02*
X16122000D01*
X16075000Y11773000D02*
Y11888000D01*
X16088399Y11773000D02*
Y11888000D01*
X15631602Y11773000D02*
X16088399D01*
X15631602D02*
Y11842583D01*
X15645000Y11838000D01*
Y11773000D02*
Y11838000D01*
X15631602Y12013418D02*
X15645000Y12018000D01*
X15631602Y12013418D02*
Y12083000D01*
X16088399D01*
X15645000Y12018000D02*
Y12083000D01*
X16088399Y11968000D02*
Y12083000D01*
X16075000Y11968000D02*
Y12083000D01*
X15914999Y11888000D02*
Y11968000D01*
X15835001D02*
X15914999D01*
X15835001Y11888000D02*
Y11968000D01*
Y11888000D02*
X15914999D01*
X15889000Y11914000D02*
X15914999Y11888000D01*
X15889000Y11914000D02*
Y11942000D01*
X15914999Y11968000D01*
X15835001D02*
X15861795Y11941205D01*
X15835001Y11888000D02*
X15861000Y11914000D01*
X15889000D01*
X15861000D02*
Y11942000D01*
X15888985Y11942000D01*
X16075000Y11968000D02*
X16122000D01*
X16210001Y12129000D02*
Y12427000D01*
X16142000Y12403500D02*
X16210001Y12427000D01*
X16142000Y12152500D02*
Y12403500D01*
Y12152500D02*
X16210001Y12129000D01*
X16075000Y12238000D02*
X16122000D01*
X16075000Y12123000D02*
Y12238000D01*
X16088399Y12123000D02*
Y12238000D01*
X15631602Y12123000D02*
X16088399D01*
X15631602D02*
Y12192582D01*
X15645000Y12188000D01*
Y12123000D02*
Y12188000D01*
X15631602Y12363417D02*
X15645000Y12368000D01*
X15631602Y12363417D02*
Y12433000D01*
X16088399D01*
X15645000Y12368000D02*
Y12433000D01*
X16088399Y12318000D02*
Y12433000D01*
X16075000Y12318000D02*
Y12433000D01*
X15914999Y12238000D02*
Y12318000D01*
X15835001D02*
X15914999D01*
X15835001Y12238000D02*
Y12318000D01*
Y12238000D02*
X15914999D01*
X15889000Y12264000D02*
X15914999Y12238000D01*
X15889000Y12264000D02*
Y12292000D01*
X15914999Y12318000D01*
X15835001D02*
X15861795Y12291205D01*
X15835001Y12238000D02*
X15861000Y12264000D01*
X15889000D01*
X15861000D02*
Y12292000D01*
X15888985Y12292000D01*
X16075000Y12318000D02*
X16122000D01*
X10243000Y12041000D02*
Y13771001D01*
Y12041000D02*
X10968000D01*
Y13771001D01*
X10243000D02*
X10968000D01*
X10333000Y12932001D02*
Y13230000D01*
Y12932001D02*
X10401000Y12955499D01*
Y13206500D01*
X10333000Y13230000D02*
X10401000Y13206500D01*
X10421000Y13121001D02*
X10468000D01*
Y13236000D01*
X10454602Y13121001D02*
Y13236000D01*
X10911398D01*
Y13166418D02*
Y13236000D01*
X10898000Y13171001D02*
X10911398Y13166418D01*
X10898000Y13171001D02*
Y13236000D01*
Y12991000D02*
X10911398Y12995583D01*
Y12925999D02*
Y12995583D01*
X10454602Y12925999D02*
X10911398D01*
X10898000D02*
Y12991000D01*
X10454602Y12925999D02*
Y13041000D01*
X10468000Y12925999D02*
Y13041000D01*
X10628000D02*
Y13121001D01*
Y13041000D02*
X10708000D01*
Y13121001D01*
X10628000D02*
X10708000D01*
X10628000D02*
X10654000Y13095000D01*
Y13067000D02*
Y13095000D01*
X10628000Y13041000D02*
X10654000Y13067000D01*
X10681205Y13067795D02*
X10708000Y13041000D01*
X10682000Y13095000D02*
X10708000Y13121001D01*
X10654000Y13095000D02*
X10682000D01*
Y13067000D02*
Y13095000D01*
X10654015Y13067001D02*
X10682000Y13067000D01*
X10605550Y13131000D02*
X10730450D01*
X10421000Y13041000D02*
X10468000D01*
X10333000Y12582000D02*
Y12880000D01*
Y12582000D02*
X10401000Y12605500D01*
Y12856500D01*
X10333000Y12880000D02*
X10401000Y12856500D01*
X10421000Y12771000D02*
X10468000D01*
Y12886000D01*
X10454602Y12771000D02*
Y12886000D01*
X10911398D01*
Y12816418D02*
Y12886000D01*
X10898000Y12821001D02*
X10911398Y12816418D01*
X10898000Y12821001D02*
Y12886000D01*
Y12641000D02*
X10911398Y12645583D01*
Y12576000D02*
Y12645583D01*
X10454602Y12576000D02*
X10911398D01*
X10898000D02*
Y12641000D01*
X10454602Y12576000D02*
Y12691000D01*
X10468000Y12576000D02*
Y12691000D01*
X10628000D02*
Y12771000D01*
Y12691000D02*
X10708000D01*
Y12771000D01*
X10628000D02*
X10708000D01*
X10628000D02*
X10654000Y12745000D01*
Y12717000D02*
Y12745000D01*
X10628000Y12691000D02*
X10654000Y12717000D01*
X10681205Y12717795D02*
X10708000Y12691000D01*
X10682000Y12745000D02*
X10708000Y12771000D01*
X10654000Y12745000D02*
X10682000D01*
Y12717000D02*
Y12745000D01*
X10654015Y12717000D02*
X10682000Y12717000D01*
X10421000Y12691000D02*
X10468000D01*
X12072000Y16944000D02*
X12119000D01*
X12305015Y16970000D02*
X12333000Y16970000D01*
Y16998000D01*
X12305000D02*
X12333000D01*
X12359000Y17024001D01*
X12332205Y16970795D02*
X12359000Y16944000D01*
X12279000D02*
X12305000Y16970000D01*
Y16998000D01*
X12279000Y17024001D02*
X12305000Y16998000D01*
X12279000Y17024001D02*
X12359000D01*
Y16944000D02*
Y17024001D01*
X12279000Y16944000D02*
X12359000D01*
X12279000D02*
Y17024001D01*
X12119000Y16828999D02*
Y16944000D01*
X12105602Y16828999D02*
Y16944000D01*
X12549000Y16828999D02*
Y16894000D01*
X12105602Y16828999D02*
X12562398D01*
Y16898582D01*
X12549000Y16894000D02*
X12562398Y16898582D01*
X12549000Y17074001D02*
Y17139000D01*
Y17074001D02*
X12562398Y17069417D01*
Y17139000D01*
X12105602D02*
X12562398D01*
X12105602Y17024001D02*
Y17139000D01*
X12119000Y17024001D02*
Y17139000D01*
X12072000Y17024001D02*
X12119000D01*
X11984000Y17133000D02*
X12052000Y17109500D01*
Y16858501D02*
Y17109500D01*
X11984000Y16835001D02*
X12052000Y16858501D01*
X11984000Y16835001D02*
Y17133000D01*
X12072000Y17294000D02*
X12119000D01*
X12256550Y17384000D02*
X12381450D01*
X12305015Y17320000D02*
X12333000Y17320000D01*
Y17348000D01*
X12305000D02*
X12333000D01*
X12359000Y17374001D01*
X12332205Y17320795D02*
X12359000Y17294000D01*
X12279000D02*
X12305000Y17320000D01*
Y17348000D01*
X12279000Y17374001D02*
X12305000Y17348000D01*
X12279000Y17374001D02*
X12359000D01*
Y17294000D02*
Y17374001D01*
X12279000Y17294000D02*
X12359000D01*
X12279000D02*
Y17374001D01*
X12119000Y17178999D02*
Y17294000D01*
X12105602Y17178999D02*
Y17294000D01*
X12549000Y17178999D02*
Y17244000D01*
X12105602Y17178999D02*
X12562398D01*
Y17248582D01*
X12549000Y17244000D02*
X12562398Y17248582D01*
X12549000Y17424001D02*
Y17489000D01*
Y17424001D02*
X12562398Y17419418D01*
Y17489000D01*
X12105602D02*
X12562398D01*
X12105602Y17374001D02*
Y17489000D01*
X12119000Y17374001D02*
Y17489000D01*
X12072000Y17374001D02*
X12119000D01*
X11984000Y17483000D02*
X12052000Y17459500D01*
Y17208501D02*
Y17459500D01*
X11984000Y17185001D02*
X12052000Y17208501D01*
X11984000Y17185001D02*
Y17483000D01*
X11894000Y14894000D02*
Y18724001D01*
Y14894000D02*
X12619000D01*
Y18724001D01*
X11894000D02*
X12619000D01*
X11984000Y17885001D02*
Y18183000D01*
Y17885001D02*
X12052000Y17908501D01*
Y18159500D01*
X11984000Y18183000D02*
X12052000Y18159500D01*
X12072000Y18074001D02*
X12119000D01*
Y18189000D01*
X12105602Y18074001D02*
Y18189000D01*
X12562398D01*
Y18119417D02*
Y18189000D01*
X12549000Y18124001D02*
X12562398Y18119417D01*
X12549000Y18124001D02*
Y18189000D01*
Y17944000D02*
X12562398Y17948582D01*
Y17878999D02*
Y17948582D01*
X12105602Y17878999D02*
X12562398D01*
X12549000D02*
Y17944000D01*
X12105602Y17878999D02*
Y17994000D01*
X12119000Y17878999D02*
Y17994000D01*
X12279000D02*
Y18074001D01*
Y17994000D02*
X12359000D01*
Y18074001D01*
X12279000D02*
X12359000D01*
X12279000D02*
X12305000Y18048000D01*
Y18020000D02*
Y18048000D01*
X12279000Y17994000D02*
X12305000Y18020000D01*
X12332205Y18020795D02*
X12359000Y17994000D01*
X12333000Y18048000D02*
X12359000Y18074001D01*
X12305000Y18048000D02*
X12333000D01*
Y18020000D02*
Y18048000D01*
X12305015Y18020000D02*
X12333000Y18020000D01*
X12256550Y18084000D02*
X12381450D01*
X12072000Y17994000D02*
X12119000D01*
X11984000Y17535001D02*
Y17833000D01*
Y17535001D02*
X12052000Y17558501D01*
Y17809500D01*
X11984000Y17833000D02*
X12052000Y17809500D01*
X12072000Y17724001D02*
X12119000D01*
Y17839000D01*
X12105602Y17724001D02*
Y17839000D01*
X12562398D01*
Y17769417D02*
Y17839000D01*
X12549000Y17774001D02*
X12562398Y17769417D01*
X12549000Y17774001D02*
Y17839000D01*
Y17594000D02*
X12562398Y17598582D01*
Y17528999D02*
Y17598582D01*
X12105602Y17528999D02*
X12562398D01*
X12549000D02*
Y17594000D01*
X12105602Y17528999D02*
Y17644000D01*
X12119000Y17528999D02*
Y17644000D01*
X12279000D02*
Y17724001D01*
Y17644000D02*
X12359000D01*
Y17724001D01*
X12279000D02*
X12359000D01*
X12279000D02*
X12305000Y17698000D01*
Y17670000D02*
Y17698000D01*
X12279000Y17644000D02*
X12305000Y17670000D01*
X12332205Y17670795D02*
X12359000Y17644000D01*
X12333000Y17698000D02*
X12359000Y17724001D01*
X12305000Y17698000D02*
X12333000D01*
Y17670000D02*
Y17698000D01*
X12305015Y17670000D02*
X12333000Y17670000D01*
X12072000Y17644000D02*
X12119000D01*
X11984000Y16485001D02*
Y16783000D01*
Y16485001D02*
X12052000Y16508501D01*
Y16759500D01*
X11984000Y16783000D02*
X12052000Y16759500D01*
X12072000Y16674001D02*
X12119000D01*
Y16789000D01*
X12105602Y16674001D02*
Y16789000D01*
X12562398D01*
Y16719417D02*
Y16789000D01*
X12549000Y16724001D02*
X12562398Y16719417D01*
X12549000Y16724001D02*
Y16789000D01*
Y16544000D02*
X12562398Y16548582D01*
Y16478999D02*
Y16548582D01*
X12105602Y16478999D02*
X12562398D01*
X12549000D02*
Y16544000D01*
X12105602Y16478999D02*
Y16594000D01*
X12119000Y16478999D02*
Y16594000D01*
X12279000D02*
Y16674001D01*
Y16594000D02*
X12359000D01*
Y16674001D01*
X12279000D02*
X12359000D01*
X12279000D02*
X12305000Y16648000D01*
Y16620000D02*
Y16648000D01*
X12279000Y16594000D02*
X12305000Y16620000D01*
X12332205Y16620795D02*
X12359000Y16594000D01*
X12333000Y16648000D02*
X12359000Y16674001D01*
X12305000Y16648000D02*
X12333000D01*
Y16620000D02*
Y16648000D01*
X12305015Y16620000D02*
X12333000Y16620000D01*
X12072000Y16594000D02*
X12119000D01*
X11984000Y16135001D02*
Y16433000D01*
Y16135001D02*
X12052000Y16158501D01*
Y16409500D01*
X11984000Y16433000D02*
X12052000Y16409500D01*
X12072000Y16324001D02*
X12119000D01*
Y16439000D01*
X12105602Y16324001D02*
Y16439000D01*
X12562398D01*
Y16369417D02*
Y16439000D01*
X12549000Y16374001D02*
X12562398Y16369417D01*
X12549000Y16374001D02*
Y16439000D01*
Y16194000D02*
X12562398Y16198582D01*
Y16128999D02*
Y16198582D01*
X12105602Y16128999D02*
X12562398D01*
X12549000D02*
Y16194000D01*
X12105602Y16128999D02*
Y16244000D01*
X12119000Y16128999D02*
Y16244000D01*
X12279000D02*
Y16324001D01*
Y16244000D02*
X12359000D01*
Y16324001D01*
X12279000D02*
X12359000D01*
X12279000D02*
X12305000Y16298000D01*
Y16270000D02*
Y16298000D01*
X12279000Y16244000D02*
X12305000Y16270000D01*
X12332205Y16270795D02*
X12359000Y16244000D01*
X12333000Y16298000D02*
X12359000Y16324001D01*
X12305000Y16298000D02*
X12333000D01*
Y16270000D02*
Y16298000D01*
X12305015Y16270000D02*
X12333000Y16270000D01*
X12072000Y16244000D02*
X12119000D01*
X11984000Y15785001D02*
Y16083000D01*
Y15785001D02*
X12052000Y15808499D01*
Y16059500D01*
X11984000Y16083000D02*
X12052000Y16059500D01*
X12072000Y15974001D02*
X12119000D01*
Y16089000D01*
X12105602Y15974001D02*
Y16089000D01*
X12562398D01*
Y16019417D02*
Y16089000D01*
X12549000Y16024001D02*
X12562398Y16019417D01*
X12549000Y16024001D02*
Y16089000D01*
Y15844000D02*
X12562398Y15848582D01*
Y15778999D02*
Y15848582D01*
X12105602Y15778999D02*
X12562398D01*
X12549000D02*
Y15844000D01*
X12105602Y15778999D02*
Y15894000D01*
X12119000Y15778999D02*
Y15894000D01*
X12279000D02*
Y15974001D01*
Y15894000D02*
X12359000D01*
Y15974001D01*
X12279000D02*
X12359000D01*
X12279000D02*
X12305000Y15948000D01*
Y15920000D02*
Y15948000D01*
X12279000Y15894000D02*
X12305000Y15920000D01*
X12332205Y15920795D02*
X12359000Y15894000D01*
X12333000Y15948000D02*
X12359000Y15974001D01*
X12305000Y15948000D02*
X12333000D01*
Y15920000D02*
Y15948000D01*
X12305015Y15920000D02*
X12333000Y15920000D01*
X12072000Y15894000D02*
X12119000D01*
X11984000Y15435001D02*
Y15733000D01*
Y15435001D02*
X12052000Y15458501D01*
Y15709500D01*
X11984000Y15733000D02*
X12052000Y15709500D01*
X12072000Y15624001D02*
X12119000D01*
Y15739000D01*
X12105602Y15624001D02*
Y15739000D01*
X12562398D01*
Y15669417D02*
Y15739000D01*
X12549000Y15674001D02*
X12562398Y15669417D01*
X12549000Y15674001D02*
Y15739000D01*
Y15494000D02*
X12562398Y15498582D01*
Y15428999D02*
Y15498582D01*
X12105602Y15428999D02*
X12562398D01*
X12549000D02*
Y15494000D01*
X12105602Y15428999D02*
Y15544000D01*
X12119000Y15428999D02*
Y15544000D01*
X12279000D02*
Y15624001D01*
Y15544000D02*
X12359000D01*
Y15624001D01*
X12279000D02*
X12359000D01*
X12279000D02*
X12305000Y15598000D01*
Y15570000D02*
Y15598000D01*
X12279000Y15544000D02*
X12305000Y15570000D01*
X12332205Y15570795D02*
X12359000Y15544000D01*
X12333000Y15598000D02*
X12359000Y15624001D01*
X12305000Y15598000D02*
X12333000D01*
Y15570000D02*
Y15598000D01*
X12305015Y15570000D02*
X12333000Y15570000D01*
X12072000Y15544000D02*
X12119000D01*
X10421000Y16944000D02*
X10468000D01*
X10654015Y16970001D02*
X10682000Y16970000D01*
Y16998000D01*
X10654000D02*
X10682000D01*
X10708000Y17024001D01*
X10681205Y16970795D02*
X10708000Y16944000D01*
X10628000D02*
X10654000Y16970000D01*
Y16998000D01*
X10628000Y17024001D02*
X10654000Y16998000D01*
X10628000Y17024001D02*
X10708000D01*
Y16944000D02*
Y17024001D01*
X10628000Y16944000D02*
X10708000D01*
X10628000D02*
Y17024001D01*
X10468000Y16828999D02*
Y16944000D01*
X10454602Y16828999D02*
Y16944000D01*
X10898000Y16828999D02*
Y16894000D01*
X10454602Y16828999D02*
X10911398D01*
Y16898582D01*
X10898000Y16894000D02*
X10911398Y16898582D01*
X10898000Y17074001D02*
Y17139000D01*
Y17074001D02*
X10911398Y17069418D01*
Y17139000D01*
X10454602D02*
X10911398D01*
X10454602Y17024001D02*
Y17139000D01*
X10468000Y17024001D02*
Y17139000D01*
X10421000Y17024001D02*
X10468000D01*
X10333000Y17133000D02*
X10401000Y17109500D01*
Y16858501D02*
Y17109500D01*
X10333000Y16835001D02*
X10401000Y16858501D01*
X10333000Y16835001D02*
Y17133000D01*
X10421000Y17294000D02*
X10468000D01*
X10605550Y17384000D02*
X10730450D01*
X10654015Y17320001D02*
X10682000Y17320000D01*
Y17348000D01*
X10654000D02*
X10682000D01*
X10708000Y17374001D01*
X10681205Y17320795D02*
X10708000Y17294000D01*
X10628000D02*
X10654000Y17320000D01*
Y17348000D01*
X10628000Y17374001D02*
X10654000Y17348000D01*
X10628000Y17374001D02*
X10708000D01*
Y17294000D02*
Y17374001D01*
X10628000Y17294000D02*
X10708000D01*
X10628000D02*
Y17374001D01*
X10468000Y17178999D02*
Y17294000D01*
X10454602Y17178999D02*
Y17294000D01*
X10898000Y17178999D02*
Y17244000D01*
X10454602Y17178999D02*
X10911398D01*
Y17248582D01*
X10898000Y17244000D02*
X10911398Y17248582D01*
X10898000Y17424001D02*
Y17489000D01*
Y17424001D02*
X10911398Y17419418D01*
Y17489000D01*
X10454602D02*
X10911398D01*
X10454602Y17374001D02*
Y17489000D01*
X10468000Y17374001D02*
Y17489000D01*
X10421000Y17374001D02*
X10468000D01*
X10333000Y17483000D02*
X10401000Y17459502D01*
Y17208501D02*
Y17459502D01*
X10333000Y17185001D02*
X10401000Y17208501D01*
X10333000Y17185001D02*
Y17483000D01*
X10243000Y14894000D02*
Y18724001D01*
Y14894000D02*
X10968000D01*
Y18724001D01*
X10243000D02*
X10968000D01*
X10333000Y17885001D02*
Y18183000D01*
Y17885001D02*
X10401000Y17908501D01*
Y18159500D01*
X10333000Y18183000D02*
X10401000Y18159500D01*
X10421000Y18074001D02*
X10468000D01*
Y18189000D01*
X10454602Y18074001D02*
Y18189000D01*
X10911398D01*
Y18119418D02*
Y18189000D01*
X10898000Y18124001D02*
X10911398Y18119418D01*
X10898000Y18124001D02*
Y18189000D01*
Y17944000D02*
X10911398Y17948582D01*
Y17878999D02*
Y17948582D01*
X10454602Y17878999D02*
X10911398D01*
X10898000D02*
Y17944000D01*
X10454602Y17878999D02*
Y17994000D01*
X10468000Y17878999D02*
Y17994000D01*
X10628000D02*
Y18074001D01*
Y17994000D02*
X10708000D01*
Y18074001D01*
X10628000D02*
X10708000D01*
X10628000D02*
X10654000Y18048000D01*
Y18020000D02*
Y18048000D01*
X10628000Y17994000D02*
X10654000Y18020000D01*
X10681205Y18020795D02*
X10708000Y17994000D01*
X10682000Y18048000D02*
X10708000Y18074001D01*
X10654000Y18048000D02*
X10682000D01*
Y18020000D02*
Y18048000D01*
X10654015Y18020001D02*
X10682000Y18020000D01*
X10605550Y18084000D02*
X10730450D01*
X10421000Y17994000D02*
X10468000D01*
X10333000Y17535001D02*
Y17833000D01*
Y17535001D02*
X10401000Y17558501D01*
Y17809500D01*
X10333000Y17833000D02*
X10401000Y17809500D01*
X10421000Y17724001D02*
X10468000D01*
Y17839000D01*
X10454602Y17724001D02*
Y17839000D01*
X10911398D01*
Y17769418D02*
Y17839000D01*
X10898000Y17774001D02*
X10911398Y17769418D01*
X10898000Y17774001D02*
Y17839000D01*
Y17594000D02*
X10911398Y17598582D01*
Y17528999D02*
Y17598582D01*
X10454602Y17528999D02*
X10911398D01*
X10898000D02*
Y17594000D01*
X10454602Y17528999D02*
Y17644000D01*
X10468000Y17528999D02*
Y17644000D01*
X10628000D02*
Y17724001D01*
Y17644000D02*
X10708000D01*
Y17724001D01*
X10628000D02*
X10708000D01*
X10628000D02*
X10654000Y17698000D01*
Y17670000D02*
Y17698000D01*
X10628000Y17644000D02*
X10654000Y17670000D01*
X10681205Y17670795D02*
X10708000Y17644000D01*
X10682000Y17698000D02*
X10708000Y17724001D01*
X10654000Y17698000D02*
X10682000D01*
Y17670000D02*
Y17698000D01*
X10654015Y17670000D02*
X10682000Y17670000D01*
X10421000Y17644000D02*
X10468000D01*
X10333000Y16485001D02*
Y16783000D01*
Y16485001D02*
X10401000Y16508501D01*
Y16759500D01*
X10333000Y16783000D02*
X10401000Y16759500D01*
X10421000Y16674001D02*
X10468000D01*
Y16789000D01*
X10454602Y16674001D02*
Y16789000D01*
X10911398D01*
Y16719418D02*
Y16789000D01*
X10898000Y16724001D02*
X10911398Y16719418D01*
X10898000Y16724001D02*
Y16789000D01*
Y16544000D02*
X10911398Y16548582D01*
Y16478999D02*
Y16548582D01*
X10454602Y16478999D02*
X10911398D01*
X10898000D02*
Y16544000D01*
X10454602Y16478999D02*
Y16594000D01*
X10468000Y16478999D02*
Y16594000D01*
X10628000D02*
Y16674001D01*
Y16594000D02*
X10708000D01*
Y16674001D01*
X10628000D02*
X10708000D01*
X10628000D02*
X10654000Y16648000D01*
Y16620000D02*
Y16648000D01*
X10628000Y16594000D02*
X10654000Y16620000D01*
X10681205Y16620795D02*
X10708000Y16594000D01*
X10682000Y16648000D02*
X10708000Y16674001D01*
X10654000Y16648000D02*
X10682000D01*
Y16620000D02*
Y16648000D01*
X10654015Y16620001D02*
X10682000Y16620000D01*
X10421000Y16594000D02*
X10468000D01*
X10333000Y16135001D02*
Y16433000D01*
Y16135001D02*
X10401000Y16158501D01*
Y16409500D01*
X10333000Y16433000D02*
X10401000Y16409500D01*
X10421000Y16324001D02*
X10468000D01*
Y16439000D01*
X10454602Y16324001D02*
Y16439000D01*
X10911398D01*
Y16369418D02*
Y16439000D01*
X10898000Y16374001D02*
X10911398Y16369418D01*
X10898000Y16374001D02*
Y16439000D01*
Y16194000D02*
X10911398Y16198582D01*
Y16128999D02*
Y16198582D01*
X10454602Y16128999D02*
X10911398D01*
X10898000D02*
Y16194000D01*
X10454602Y16128999D02*
Y16244000D01*
X10468000Y16128999D02*
Y16244000D01*
X10628000D02*
Y16324001D01*
Y16244000D02*
X10708000D01*
Y16324001D01*
X10628000D02*
X10708000D01*
X10628000D02*
X10654000Y16298000D01*
Y16270000D02*
Y16298000D01*
X10628000Y16244000D02*
X10654000Y16270000D01*
X10681205Y16270795D02*
X10708000Y16244000D01*
X10682000Y16298000D02*
X10708000Y16324001D01*
X10654000Y16298000D02*
X10682000D01*
Y16270000D02*
Y16298000D01*
X10654015Y16270000D02*
X10682000Y16270000D01*
X10421000Y16244000D02*
X10468000D01*
X10333000Y15785001D02*
Y16083000D01*
Y15785001D02*
X10401000Y15808501D01*
Y16059500D01*
X10333000Y16083000D02*
X10401000Y16059500D01*
X10421000Y15974001D02*
X10468000D01*
Y16089000D01*
X10454602Y15974001D02*
Y16089000D01*
X10911398D01*
Y16019418D02*
Y16089000D01*
X10898000Y16024001D02*
X10911398Y16019418D01*
X10898000Y16024001D02*
Y16089000D01*
Y15844000D02*
X10911398Y15848582D01*
Y15778999D02*
Y15848582D01*
X10454602Y15778999D02*
X10911398D01*
X10898000D02*
Y15844000D01*
X10454602Y15778999D02*
Y15894000D01*
X10468000Y15778999D02*
Y15894000D01*
X10628000D02*
Y15974001D01*
Y15894000D02*
X10708000D01*
Y15974001D01*
X10628000D02*
X10708000D01*
X10628000D02*
X10654000Y15948000D01*
Y15920000D02*
Y15948000D01*
X10628000Y15894000D02*
X10654000Y15920000D01*
X10681205Y15920795D02*
X10708000Y15894000D01*
X10682000Y15948000D02*
X10708000Y15974001D01*
X10654000Y15948000D02*
X10682000D01*
Y15920000D02*
Y15948000D01*
X10654015Y15920000D02*
X10682000Y15920000D01*
X10421000Y15894000D02*
X10468000D01*
X10333000Y15435001D02*
Y15733000D01*
Y15435001D02*
X10401000Y15458501D01*
Y15709500D01*
X10333000Y15733000D02*
X10401000Y15709500D01*
X10421000Y15624001D02*
X10468000D01*
Y15739000D01*
X10454602Y15624001D02*
Y15739000D01*
X10911398D01*
Y15669418D02*
Y15739000D01*
X10898000Y15674001D02*
X10911398Y15669418D01*
X10898000Y15674001D02*
Y15739000D01*
Y15494000D02*
X10911398Y15498582D01*
Y15428999D02*
Y15498582D01*
X10454602Y15428999D02*
X10911398D01*
X10898000D02*
Y15494000D01*
X10454602Y15428999D02*
Y15544000D01*
X10468000Y15428999D02*
Y15544000D01*
X10628000D02*
Y15624001D01*
Y15544000D02*
X10708000D01*
Y15624001D01*
X10628000D02*
X10708000D01*
X10628000D02*
X10654000Y15598000D01*
Y15570000D02*
Y15598000D01*
X10628000Y15544000D02*
X10654000Y15570000D01*
X10681205Y15570795D02*
X10708000Y15544000D01*
X10682000Y15598000D02*
X10708000Y15624001D01*
X10654000Y15598000D02*
X10682000D01*
Y15570000D02*
Y15598000D01*
X10654015Y15570001D02*
X10682000Y15570000D01*
X10421000Y15544000D02*
X10468000D01*
X8381999Y18279498D02*
X8429501D01*
X8494499Y18344499D01*
X8429501Y18174498D02*
Y18279498D01*
X8739500Y10019495D02*
Y18174498D01*
X8024500Y18279498D02*
X8128000D01*
X7959499Y18344499D02*
X8024500Y18279498D01*
Y9914494D02*
Y18279498D01*
X7959499Y9849496D02*
X8024500Y9914494D01*
X8128000D01*
X8429501D02*
Y10019495D01*
Y9914494D02*
X8494499Y9849496D01*
X8381999Y9914494D02*
X8429501D01*
X8636000Y18174498D02*
X8739500D01*
X8804501Y18239497D01*
X8636000Y10019495D02*
X8739500D01*
X8804501Y9954494D01*
X8382000Y18174500D02*
Y18279498D01*
Y18344499D01*
X8429500Y18174500D02*
X8636000D01*
X8200281Y18344501D02*
X8381999Y18344499D01*
X8494500Y18174500D02*
Y18344499D01*
X8128000Y18174500D02*
Y18279498D01*
Y18344499D01*
X8636000Y18239499D02*
X8804500D01*
X8636000Y9954494D02*
X8804500D01*
X8429500Y10019495D02*
X8636000D01*
X7959500Y18344499D02*
X8128000D01*
Y9914495D02*
Y10019495D01*
Y9849494D02*
Y9914495D01*
X7959500Y9849494D02*
X8128000D01*
X8382000Y9914495D02*
Y10019495D01*
Y9849494D02*
Y9914495D01*
X8494500Y9849494D02*
Y10019495D01*
X8200281Y9849495D02*
X8381999Y9849496D01*
X8494500Y9849495D02*
X8503719D01*
X8382000Y9849494D02*
X8494500D01*
X8636000Y18174500D02*
Y18239499D01*
Y9954494D02*
Y10019495D01*
X8128000D02*
X8382000D01*
X8649500Y9596995D02*
X8907000D01*
X7857000D02*
X8054500D01*
Y9356995D02*
Y9596995D01*
X8054500D02*
X8200281Y9849495D01*
X8649500Y9356995D02*
Y9596995D01*
X8503719Y9849495D02*
X8649500Y9596995D01*
X8503719Y18344501D02*
X8649500Y18597000D01*
X8054500D02*
X8200281Y18344501D01*
X8128000Y18174500D02*
X8382000D01*
X8649500Y18597000D02*
Y18837000D01*
Y18597000D02*
X8907000D01*
X7857000D02*
X8054500D01*
Y18837000D01*
X8804501Y9954494D02*
Y18239497D01*
X7959499Y9849496D02*
Y18344499D01*
X7857000Y9456995D02*
X7857000Y18737000D01*
X7957000Y9356995D02*
X8807000Y9356995D01*
X8907000Y18737000D02*
X8907000Y9456995D01*
X7957000Y18837000D02*
X8807000D01*
X19939000Y11074401D02*
Y11328401D01*
X19685001D02*
X19939000D01*
X19685001Y11074401D02*
Y11328401D01*
X20192999Y11074401D02*
X20320000D01*
X19939000D02*
X20192999D01*
X19431000Y9677400D02*
Y11074401D01*
Y9677400D02*
X19685001D01*
X20192999D02*
Y11074401D01*
X20320000Y10947401D02*
Y11074401D01*
X20192999Y10947401D02*
X20320000D01*
X20192999Y10439400D02*
X20320000D01*
Y10312400D02*
Y10439400D01*
X20192999Y10312400D02*
X20320000D01*
X20192999Y9804400D02*
X20320000D01*
Y9677400D02*
Y9804400D01*
X20192999Y9677400D02*
X20320000D01*
X19939000Y9423400D02*
Y9677400D01*
X19685001Y9423400D02*
X19939000D01*
X19685001D02*
Y9677400D01*
Y9643370D02*
X19939000D01*
X19685001Y11108430D02*
X19939000D01*
X19812000Y10991850D02*
X20110451Y10991851D01*
X20072350Y10433050D02*
Y10953751D01*
X19812000Y10433050D02*
X20072350D01*
X20110451Y10394950D02*
Y10991851D01*
X19812000Y10394951D02*
X20110451Y10394950D01*
X19812000Y10356850D02*
X20110451Y10356850D01*
Y9759950D02*
Y10356850D01*
X19812000Y9759951D02*
X20110451Y9759950D01*
X19812000Y9798050D02*
X20072350D01*
Y10318750D01*
X19812000Y10318750D02*
X20072350Y10318750D01*
X19431000Y11074401D02*
X19685001D01*
X19939000Y9677400D02*
X20192999D01*
X19812000Y10953751D02*
X20072350D01*
X20110451Y10991851D01*
X20072350Y10433050D02*
X20110451Y10394950D01*
X20072350Y10318750D02*
X20110451Y10356850D01*
X20072350Y9798050D02*
X20110451Y9759950D01*
X17525999Y18279498D02*
X17573502D01*
X17638499Y18344499D01*
X17573502Y18174498D02*
Y18279498D01*
X17883501Y10019495D02*
Y18174498D01*
X17168500Y18279498D02*
X17272000D01*
X17103499Y18344499D02*
X17168500Y18279498D01*
Y9914494D02*
Y18279498D01*
X17103499Y9849496D02*
X17168500Y9914494D01*
X17272000D01*
X17573502D02*
Y10019495D01*
Y9914494D02*
X17638499Y9849496D01*
X17525999Y9914494D02*
X17573502D01*
X17780000Y18174498D02*
X17883501D01*
X17948502Y18239497D01*
X17780000Y10019495D02*
X17883501D01*
X17948502Y9954494D01*
X17525999Y18174500D02*
Y18279498D01*
Y18344499D01*
X17573500Y18174500D02*
X17780000D01*
X17344281Y18344501D02*
X17525999Y18344499D01*
X17638499Y18174500D02*
Y18344499D01*
X17272000Y18174500D02*
Y18279498D01*
Y18344499D01*
X17780000Y18239499D02*
X17948500D01*
X17780000Y9954494D02*
X17948500D01*
X17573500Y10019495D02*
X17780000D01*
X17103500Y18344499D02*
X17272000D01*
Y9914495D02*
Y10019495D01*
Y9849494D02*
Y9914495D01*
X17103500Y9849494D02*
X17272000D01*
X17525999Y9914495D02*
Y10019495D01*
Y9849494D02*
Y9914495D01*
X17638499Y9849494D02*
Y10019495D01*
X17344281Y9849495D02*
X17525999Y9849496D01*
X17638499Y9849495D02*
X17647719D01*
X17525999Y9849494D02*
X17638499D01*
X17780000Y18174500D02*
Y18239499D01*
Y9954494D02*
Y10019495D01*
X17272000D02*
X17525999D01*
X17793500Y9596995D02*
X18050999D01*
X17000999D02*
X17198500D01*
Y9356995D02*
Y9596995D01*
X17198500D02*
X17344281Y9849495D01*
X17793500Y9356995D02*
Y9596995D01*
X17647719Y9849495D02*
X17793500Y9596995D01*
X17647719Y18344501D02*
X17793500Y18597000D01*
X17198500D02*
X17344281Y18344501D01*
X17272000Y18174500D02*
X17525999D01*
X17793500Y18597000D02*
Y18837000D01*
Y18597000D02*
X18050999D01*
X17000999D02*
X17198500D01*
Y18837000D01*
X17948502Y9954494D02*
Y18239497D01*
X17103499Y9849496D02*
Y18344499D01*
X17000999Y9456995D02*
X17000999Y18737000D01*
X17100999Y9356995D02*
X17950999Y9356995D01*
X18050999Y18737000D02*
X18050999Y9456995D01*
X17100999Y18837000D02*
X17950999D01*
X14477998Y18279498D02*
X14525500D01*
X14590498Y18344499D01*
X14525500Y18174498D02*
Y18279498D01*
X14835500Y10019495D02*
Y18174498D01*
X14120500Y18279498D02*
X14224001D01*
X14055499Y18344499D02*
X14120500Y18279498D01*
Y9914494D02*
Y18279498D01*
X14055499Y9849496D02*
X14120500Y9914494D01*
X14224001D01*
X14525500D02*
Y10019495D01*
Y9914494D02*
X14590498Y9849496D01*
X14477998Y9914494D02*
X14525500D01*
X14732001Y18174498D02*
X14835500D01*
X14900500Y18239497D01*
X14732001Y10019495D02*
X14835500D01*
X14900500Y9954494D01*
X14478000Y18174500D02*
Y18279498D01*
Y18344499D01*
X14525500Y18174500D02*
X14732001D01*
X14296281Y18344501D02*
X14477998Y18344499D01*
X14590500Y18174500D02*
Y18344499D01*
X14224001Y18174500D02*
Y18279498D01*
Y18344499D01*
X14732001Y18239499D02*
X14900500D01*
X14732001Y9954494D02*
X14900500D01*
X14525500Y10019495D02*
X14732001D01*
X14055499Y18344499D02*
X14224001D01*
Y9914495D02*
Y10019495D01*
Y9849494D02*
Y9914495D01*
X14055499Y9849494D02*
X14224001D01*
X14478000Y9914495D02*
Y10019495D01*
Y9849494D02*
Y9914495D01*
X14590500Y9849494D02*
Y10019495D01*
X14296281Y9849495D02*
X14477998Y9849496D01*
X14590500Y9849495D02*
X14599719D01*
X14478000Y9849494D02*
X14590500D01*
X14732001Y18174500D02*
Y18239499D01*
Y9954494D02*
Y10019495D01*
X14224001D02*
X14478000D01*
X14745500Y9596995D02*
X15003000D01*
X13953000D02*
X14150500D01*
Y9356995D02*
Y9596995D01*
X14150500D02*
X14296281Y9849495D01*
X14745500Y9356995D02*
Y9596995D01*
X14599719Y9849495D02*
X14745500Y9596995D01*
X14599719Y18344501D02*
X14745500Y18597000D01*
X14150500D02*
X14296281Y18344501D01*
X14224001Y18174500D02*
X14478000D01*
X14745500Y18597000D02*
Y18837000D01*
Y18597000D02*
X15003000D01*
X13953000D02*
X14150500D01*
Y18837000D01*
X14900500Y9954494D02*
Y18239497D01*
X14055499Y9849496D02*
Y18344499D01*
X13953000Y9456995D02*
X13953000Y18737000D01*
X14053000Y9356995D02*
X14903000Y9356995D01*
X15003000Y18737000D02*
X15003000Y9456995D01*
X14053000Y18837000D02*
X14903000D01*
X8063325Y18597000D02*
X8207663Y18847000D01*
X8063325Y18597000D02*
X8207663Y18347000D01*
X8496338D01*
X8640675Y18597000D01*
X8496338Y18847000D02*
X8640675Y18597000D01*
X8207663Y18847000D02*
X8496338Y18847000D01*
X8063325Y9596995D02*
X8207663Y9846995D01*
X8063325Y9596995D02*
X8207663Y9346995D01*
X8496338D01*
X8640675Y9596995D01*
X8496338Y9846995D02*
X8640675Y9596995D01*
X8207663Y9846995D02*
X8496338Y9846995D01*
X14159325Y18597000D02*
X14303664Y18847000D01*
X14159325Y18597000D02*
X14303664Y18347000D01*
X14592339D01*
X14736674Y18597000D01*
X14592339Y18847000D02*
X14736674Y18597000D01*
X14303664Y18847000D02*
X14592339Y18847000D01*
X14159325Y9597000D02*
X14303664Y9847000D01*
X14159325Y9597000D02*
X14303664Y9347000D01*
X14592339D01*
X14736674Y9597000D01*
X14592339Y9847000D02*
X14736674Y9597000D01*
X14303664Y9847000D02*
X14592339Y9847000D01*
X17207326Y18597005D02*
X17351663Y18847005D01*
X17207326Y18597005D02*
X17351663Y18347005D01*
X17640338D01*
X17784676Y18597005D01*
X17640338Y18847005D02*
X17784676Y18597005D01*
X17351663Y18847005D02*
X17640338Y18847005D01*
X17207326Y9597000D02*
X17351663Y9847000D01*
X17207326Y9597000D02*
X17351663Y9347000D01*
X17640338D01*
X17784676Y9597000D01*
X17640338Y9847000D02*
X17784676Y9597000D01*
X17351663Y9847000D02*
X17640338Y9847000D01*
%TF.MD5,7cc241786b7634dac5218374df016501*%
M02*
