%TF.GenerationSoftware,Altium Limited,Altium Designer,19.1.5 (86)*%
G04 Layer_Color=255*
%FSLAX45Y45*%
%MOMM*%
%TF.FileFunction,Pads,Bot*%
%TF.Part,Single*%
G01*
G75*
%TA.AperFunction,ViaPad*%
%ADD16C,4.45000*%
%TA.AperFunction,ComponentPad*%
%ADD17C,3.80000*%
%ADD18C,2.00000*%
%ADD19C,1.60000*%
%ADD20C,1.70000*%
%ADD21C,4.60000*%
%ADD22C,2.50000*%
D16*
X45944019Y20222002D02*
D03*
X49500021D02*
D03*
Y7971994D02*
D03*
X47976016Y7972033D02*
D03*
Y20222002D02*
D03*
X45944019Y7972033D02*
D03*
X41880017Y20222002D02*
D03*
Y7972031D02*
D03*
X37816019Y20222002D02*
D03*
Y7972029D02*
D03*
X33752017Y20222002D02*
D03*
Y7972027D02*
D03*
X29688019Y20222002D02*
D03*
Y7972025D02*
D03*
X25624017Y20222002D02*
D03*
Y7972023D02*
D03*
X21560017Y7972021D02*
D03*
Y20222002D02*
D03*
X17496017Y7972019D02*
D03*
Y20222002D02*
D03*
X14448000Y7971994D02*
D03*
Y20222002D02*
D03*
X12416002D02*
D03*
X8352000D02*
D03*
X12416002Y7971994D02*
D03*
X8352000D02*
D03*
D17*
X48056799Y10466600D02*
D03*
Y11676600D02*
D03*
X19050000Y18483800D02*
D03*
Y13773801D02*
D03*
X16002000Y18458400D02*
D03*
Y13748399D02*
D03*
X15875000Y12708000D02*
D03*
Y9398000D02*
D03*
X10668000Y12301000D02*
D03*
Y13511000D02*
D03*
X12319000Y15153999D02*
D03*
Y18464000D02*
D03*
X10668000Y15153999D02*
D03*
Y18464000D02*
D03*
D18*
X48056799Y11246600D02*
D03*
Y10896600D02*
D03*
X19050000Y14203799D02*
D03*
Y14553799D02*
D03*
Y14903799D02*
D03*
Y15253799D02*
D03*
Y15603799D02*
D03*
Y15953799D02*
D03*
Y16303799D02*
D03*
Y16653799D02*
D03*
Y17703799D02*
D03*
Y18053799D02*
D03*
Y17353799D02*
D03*
Y17003799D02*
D03*
X16002000Y14178400D02*
D03*
Y14528400D02*
D03*
Y14878400D02*
D03*
Y15228400D02*
D03*
Y15578400D02*
D03*
Y15928400D02*
D03*
Y16278400D02*
D03*
Y16628400D02*
D03*
Y17678400D02*
D03*
Y18028400D02*
D03*
Y17328400D02*
D03*
Y16978400D02*
D03*
X15875000Y10878000D02*
D03*
Y10528000D02*
D03*
Y9828000D02*
D03*
Y10178000D02*
D03*
Y11228000D02*
D03*
Y11578000D02*
D03*
Y11928000D02*
D03*
Y12278000D02*
D03*
X10668000Y13081000D02*
D03*
Y12731000D02*
D03*
X12319000Y16984000D02*
D03*
Y17334000D02*
D03*
Y18034000D02*
D03*
Y17684000D02*
D03*
Y16634000D02*
D03*
Y16284000D02*
D03*
Y15934000D02*
D03*
Y15584000D02*
D03*
X10668000Y16984000D02*
D03*
Y17334000D02*
D03*
Y18034000D02*
D03*
Y17684000D02*
D03*
Y16634000D02*
D03*
Y16284000D02*
D03*
Y15934000D02*
D03*
Y15584000D02*
D03*
D19*
X46354999Y10896600D02*
D03*
X47370999D02*
D03*
X46354999Y11252200D02*
D03*
X47370999D02*
D03*
D20*
X8128000Y11938000D02*
D03*
Y11684000D02*
D03*
Y11430000D02*
D03*
Y11176000D02*
D03*
Y10922000D02*
D03*
Y10668000D02*
D03*
Y10414000D02*
D03*
Y10160000D02*
D03*
Y13970000D02*
D03*
Y13716000D02*
D03*
Y13462000D02*
D03*
Y13208000D02*
D03*
Y12953999D02*
D03*
Y12700000D02*
D03*
Y12446000D02*
D03*
Y12192000D02*
D03*
Y16002000D02*
D03*
Y15748000D02*
D03*
Y15494000D02*
D03*
Y15239999D02*
D03*
Y14986000D02*
D03*
Y14732001D02*
D03*
Y14478000D02*
D03*
Y14224001D02*
D03*
Y16256000D02*
D03*
Y16510001D02*
D03*
Y16764000D02*
D03*
Y17017999D02*
D03*
Y17272000D02*
D03*
Y17525999D02*
D03*
Y17780000D02*
D03*
Y18034000D02*
D03*
X8636000D02*
D03*
Y17780000D02*
D03*
Y17525999D02*
D03*
Y17272000D02*
D03*
Y17017999D02*
D03*
Y16764000D02*
D03*
Y16510001D02*
D03*
Y16256000D02*
D03*
Y14224001D02*
D03*
Y14478000D02*
D03*
Y14732001D02*
D03*
Y14986000D02*
D03*
Y15239999D02*
D03*
Y15494000D02*
D03*
Y15748000D02*
D03*
Y16002000D02*
D03*
Y12192000D02*
D03*
Y12446000D02*
D03*
Y12700000D02*
D03*
Y12953999D02*
D03*
Y13208000D02*
D03*
Y13462000D02*
D03*
Y13716000D02*
D03*
Y13970000D02*
D03*
Y10160000D02*
D03*
Y10414000D02*
D03*
Y10668000D02*
D03*
Y10922000D02*
D03*
Y11176000D02*
D03*
Y11430000D02*
D03*
Y11684000D02*
D03*
Y11938000D02*
D03*
X17272000D02*
D03*
Y11684000D02*
D03*
Y11430000D02*
D03*
Y11176000D02*
D03*
Y10922000D02*
D03*
Y10668000D02*
D03*
Y10414000D02*
D03*
Y10160000D02*
D03*
Y13970000D02*
D03*
Y13716000D02*
D03*
Y13462000D02*
D03*
Y13208000D02*
D03*
Y12953999D02*
D03*
Y12700000D02*
D03*
Y12446000D02*
D03*
Y12192000D02*
D03*
Y16002000D02*
D03*
Y15748000D02*
D03*
Y15494000D02*
D03*
Y15239999D02*
D03*
Y14986000D02*
D03*
Y14732001D02*
D03*
Y14478000D02*
D03*
Y14224001D02*
D03*
Y16256000D02*
D03*
Y16510001D02*
D03*
Y16764000D02*
D03*
Y17017999D02*
D03*
Y17272000D02*
D03*
Y17525999D02*
D03*
Y17780000D02*
D03*
Y18034000D02*
D03*
X17780000D02*
D03*
Y17780000D02*
D03*
Y17525999D02*
D03*
Y17272000D02*
D03*
Y17017999D02*
D03*
Y16764000D02*
D03*
Y16510001D02*
D03*
Y16256000D02*
D03*
Y14224001D02*
D03*
Y14478000D02*
D03*
Y14732001D02*
D03*
Y14986000D02*
D03*
Y15239999D02*
D03*
Y15494000D02*
D03*
Y15748000D02*
D03*
Y16002000D02*
D03*
Y12192000D02*
D03*
Y12446000D02*
D03*
Y12700000D02*
D03*
Y12953999D02*
D03*
Y13208000D02*
D03*
Y13462000D02*
D03*
Y13716000D02*
D03*
Y13970000D02*
D03*
Y10160000D02*
D03*
Y10414000D02*
D03*
Y10668000D02*
D03*
Y10922000D02*
D03*
Y11176000D02*
D03*
Y11430000D02*
D03*
Y11684000D02*
D03*
Y11938000D02*
D03*
X14224001D02*
D03*
Y11684000D02*
D03*
Y11430000D02*
D03*
Y11176000D02*
D03*
Y10922000D02*
D03*
Y10668000D02*
D03*
Y10414000D02*
D03*
Y10160000D02*
D03*
Y13970000D02*
D03*
Y13716000D02*
D03*
Y13462000D02*
D03*
Y13208000D02*
D03*
Y12953999D02*
D03*
Y12700000D02*
D03*
Y12446000D02*
D03*
Y12192000D02*
D03*
Y16002000D02*
D03*
Y15748000D02*
D03*
Y15494000D02*
D03*
Y15239999D02*
D03*
Y14986000D02*
D03*
Y14732001D02*
D03*
Y14478000D02*
D03*
Y14224001D02*
D03*
Y16256000D02*
D03*
Y16510001D02*
D03*
Y16764000D02*
D03*
Y17017999D02*
D03*
Y17272000D02*
D03*
Y17525999D02*
D03*
Y17780000D02*
D03*
Y18034000D02*
D03*
X14732001D02*
D03*
Y17780000D02*
D03*
Y17525999D02*
D03*
Y17272000D02*
D03*
Y17017999D02*
D03*
Y16764000D02*
D03*
Y16510001D02*
D03*
Y16256000D02*
D03*
Y14224001D02*
D03*
Y14478000D02*
D03*
Y14732001D02*
D03*
Y14986000D02*
D03*
Y15239999D02*
D03*
Y15494000D02*
D03*
Y15748000D02*
D03*
Y16002000D02*
D03*
Y12192000D02*
D03*
Y12446000D02*
D03*
Y12700000D02*
D03*
Y12953999D02*
D03*
Y13208000D02*
D03*
Y13462000D02*
D03*
Y13716000D02*
D03*
Y13970000D02*
D03*
Y10160000D02*
D03*
Y10414000D02*
D03*
Y10668000D02*
D03*
Y10922000D02*
D03*
Y11176000D02*
D03*
Y11430000D02*
D03*
Y11684000D02*
D03*
Y11938000D02*
D03*
D21*
X8352000Y18597000D02*
D03*
Y9596995D02*
D03*
X17496001Y18597000D02*
D03*
Y9596995D02*
D03*
X14448000Y18597000D02*
D03*
Y9596995D02*
D03*
D22*
X19812000Y10058400D02*
D03*
Y10693401D02*
D03*
%TF.MD5,892075b71fd12b9e799ee9b2d8ae9538*%
M02*
