%TF.GenerationSoftware,Altium Limited,Altium Designer,19.1.5 (86)*%
G04 Layer_Color=16711935*
%FSLAX45Y45*%
%MOMM*%
%TF.FileFunction,Soldermask,Bot*%
%TF.Part,Single*%
G01*
G75*
%TA.AperFunction,NonConductor*%
%ADD15C,0.17780*%
%TA.AperFunction,ViaPad*%
%ADD16C,4.45000*%
%TA.AperFunction,ComponentPad*%
%ADD17C,3.80000*%
%ADD18C,2.00000*%
%ADD19C,1.60000*%
%ADD20C,1.70000*%
%ADD21C,4.60000*%
%ADD22C,2.50000*%
%TA.AperFunction,NonConductor*%
%ADD26R,424.64506X6.56501*%
%ADD27R,424.64500X6.56501*%
%ADD28R,8.89000X14.28750*%
D15*
X18065750Y4730709D02*
Y4540250D01*
Y4730709D02*
X17984125D01*
X17956915Y4721640D01*
X17947847Y4712570D01*
X17938777Y4694431D01*
Y4676292D01*
X17947847Y4658153D01*
X17956915Y4649084D01*
X17984125Y4640014D01*
X18065750D02*
X17984125D01*
X17956915Y4630945D01*
X17947847Y4621875D01*
X17938777Y4603736D01*
Y4576528D01*
X17947847Y4558389D01*
X17956915Y4549320D01*
X17984125Y4540250D01*
X18065750D01*
X17850803Y4667223D02*
X17868942Y4658153D01*
X17887080Y4640014D01*
X17896152Y4612806D01*
Y4594667D01*
X17887080Y4567458D01*
X17868942Y4549320D01*
X17850803Y4540250D01*
X17823595D01*
X17805457Y4549320D01*
X17787317Y4567458D01*
X17778247Y4594667D01*
Y4612806D01*
X17787317Y4640014D01*
X17805457Y4658153D01*
X17823595Y4667223D01*
X17850803D01*
X17709319Y4730709D02*
Y4576528D01*
X17700250Y4549320D01*
X17682111Y4540250D01*
X17663972D01*
X17736528Y4667223D02*
X17673041D01*
X17609555Y4730709D02*
Y4576528D01*
X17600485Y4549320D01*
X17582346Y4540250D01*
X17564207D01*
X17636763Y4667223D02*
X17573277D01*
X17491652D02*
X17509790Y4658153D01*
X17527930Y4640014D01*
X17537000Y4612806D01*
Y4594667D01*
X17527930Y4567458D01*
X17509790Y4549320D01*
X17491652Y4540250D01*
X17464442D01*
X17446304Y4549320D01*
X17428165Y4567458D01*
X17419096Y4594667D01*
Y4612806D01*
X17428165Y4640014D01*
X17446304Y4658153D01*
X17464442Y4667223D01*
X17491652D01*
X17377376D02*
Y4540250D01*
Y4630945D02*
X17350166Y4658153D01*
X17332030Y4667223D01*
X17304820D01*
X17286681Y4658153D01*
X17277612Y4630945D01*
Y4540250D01*
Y4630945D02*
X17250403Y4658153D01*
X17232265Y4667223D01*
X17205057D01*
X17186917Y4658153D01*
X17177847Y4630945D01*
Y4540250D01*
X16841370Y4703501D02*
X16859508Y4721640D01*
X16886717Y4730709D01*
X16922995D01*
X16950203Y4721640D01*
X16968343Y4703501D01*
Y4685362D01*
X16959273Y4667223D01*
X16950203Y4658153D01*
X16932063Y4649084D01*
X16877647Y4630945D01*
X16859508Y4621875D01*
X16850439Y4612806D01*
X16841370Y4594667D01*
Y4567458D01*
X16859508Y4549320D01*
X16886717Y4540250D01*
X16922995D01*
X16950203Y4549320D01*
X16968343Y4567458D01*
X16753395Y4667223D02*
X16771535Y4658153D01*
X16789673Y4640014D01*
X16798743Y4612806D01*
Y4594667D01*
X16789673Y4567458D01*
X16771535Y4549320D01*
X16753395Y4540250D01*
X16726187D01*
X16708047Y4549320D01*
X16689909Y4567458D01*
X16680840Y4594667D01*
Y4612806D01*
X16689909Y4640014D01*
X16708047Y4658153D01*
X16726187Y4667223D01*
X16753395D01*
X16639120Y4730709D02*
Y4540250D01*
X16490379Y4730709D02*
Y4540250D01*
Y4640014D02*
X16508519Y4658153D01*
X16526659Y4667223D01*
X16553867D01*
X16572006Y4658153D01*
X16590144Y4640014D01*
X16599214Y4612806D01*
Y4594667D01*
X16590144Y4567458D01*
X16572006Y4549320D01*
X16553867Y4540250D01*
X16526659D01*
X16508519Y4549320D01*
X16490379Y4567458D01*
X16439590Y4612806D02*
X16330757D01*
Y4630945D01*
X16339827Y4649084D01*
X16348895Y4658153D01*
X16367035Y4667223D01*
X16394244D01*
X16412383Y4658153D01*
X16430522Y4640014D01*
X16439590Y4612806D01*
Y4594667D01*
X16430522Y4567458D01*
X16412383Y4549320D01*
X16394244Y4540250D01*
X16367035D01*
X16348895Y4549320D01*
X16330757Y4567458D01*
X16289944Y4667223D02*
Y4540250D01*
Y4612806D02*
X16280875Y4640014D01*
X16262737Y4658153D01*
X16244597Y4667223D01*
X16217389D01*
D16*
X45944019Y20222002D02*
D03*
X49500021D02*
D03*
Y7971994D02*
D03*
X47976016Y7972033D02*
D03*
Y20222002D02*
D03*
X45944019Y7972033D02*
D03*
X41880017Y20222002D02*
D03*
Y7972031D02*
D03*
X37816019Y20222002D02*
D03*
Y7972029D02*
D03*
X33752017Y20222002D02*
D03*
Y7972027D02*
D03*
X29688019Y20222002D02*
D03*
Y7972025D02*
D03*
X25624017Y20222002D02*
D03*
Y7972023D02*
D03*
X21560017Y7972021D02*
D03*
Y20222002D02*
D03*
X17496017Y7972019D02*
D03*
Y20222002D02*
D03*
X14448000Y7971994D02*
D03*
Y20222002D02*
D03*
X12416002D02*
D03*
X8352000D02*
D03*
X12416002Y7971994D02*
D03*
X8352000D02*
D03*
D17*
X48056799Y10466600D02*
D03*
Y11676600D02*
D03*
X19050000Y18483800D02*
D03*
Y13773801D02*
D03*
X16002000Y18458400D02*
D03*
Y13748399D02*
D03*
X15875000Y12708000D02*
D03*
Y9398000D02*
D03*
X10668000Y12301000D02*
D03*
Y13511000D02*
D03*
X12319000Y15153999D02*
D03*
Y18464000D02*
D03*
X10668000Y15153999D02*
D03*
Y18464000D02*
D03*
D18*
X48056799Y11246600D02*
D03*
Y10896600D02*
D03*
X19050000Y14203799D02*
D03*
Y14553799D02*
D03*
Y14903799D02*
D03*
Y15253799D02*
D03*
Y15603799D02*
D03*
Y15953799D02*
D03*
Y16303799D02*
D03*
Y16653799D02*
D03*
Y17703799D02*
D03*
Y18053799D02*
D03*
Y17353799D02*
D03*
Y17003799D02*
D03*
X16002000Y14178400D02*
D03*
Y14528400D02*
D03*
Y14878400D02*
D03*
Y15228400D02*
D03*
Y15578400D02*
D03*
Y15928400D02*
D03*
Y16278400D02*
D03*
Y16628400D02*
D03*
Y17678400D02*
D03*
Y18028400D02*
D03*
Y17328400D02*
D03*
Y16978400D02*
D03*
X15875000Y10878000D02*
D03*
Y10528000D02*
D03*
Y9828000D02*
D03*
Y10178000D02*
D03*
Y11228000D02*
D03*
Y11578000D02*
D03*
Y11928000D02*
D03*
Y12278000D02*
D03*
X10668000Y13081000D02*
D03*
Y12731000D02*
D03*
X12319000Y16984000D02*
D03*
Y17334000D02*
D03*
Y18034000D02*
D03*
Y17684000D02*
D03*
Y16634000D02*
D03*
Y16284000D02*
D03*
Y15934000D02*
D03*
Y15584000D02*
D03*
X10668000Y16984000D02*
D03*
Y17334000D02*
D03*
Y18034000D02*
D03*
Y17684000D02*
D03*
Y16634000D02*
D03*
Y16284000D02*
D03*
Y15934000D02*
D03*
Y15584000D02*
D03*
D19*
X46354999Y10896600D02*
D03*
X47370999D02*
D03*
X46354999Y11252200D02*
D03*
X47370999D02*
D03*
D20*
X8128000Y11938000D02*
D03*
Y11684000D02*
D03*
Y11430000D02*
D03*
Y11176000D02*
D03*
Y10922000D02*
D03*
Y10668000D02*
D03*
Y10414000D02*
D03*
Y10160000D02*
D03*
Y13970000D02*
D03*
Y13716000D02*
D03*
Y13462000D02*
D03*
Y13208000D02*
D03*
Y12953999D02*
D03*
Y12700000D02*
D03*
Y12446000D02*
D03*
Y12192000D02*
D03*
Y16002000D02*
D03*
Y15748000D02*
D03*
Y15494000D02*
D03*
Y15239999D02*
D03*
Y14986000D02*
D03*
Y14732001D02*
D03*
Y14478000D02*
D03*
Y14224001D02*
D03*
Y16256000D02*
D03*
Y16510001D02*
D03*
Y16764000D02*
D03*
Y17017999D02*
D03*
Y17272000D02*
D03*
Y17525999D02*
D03*
Y17780000D02*
D03*
Y18034000D02*
D03*
X8636000D02*
D03*
Y17780000D02*
D03*
Y17525999D02*
D03*
Y17272000D02*
D03*
Y17017999D02*
D03*
Y16764000D02*
D03*
Y16510001D02*
D03*
Y16256000D02*
D03*
Y14224001D02*
D03*
Y14478000D02*
D03*
Y14732001D02*
D03*
Y14986000D02*
D03*
Y15239999D02*
D03*
Y15494000D02*
D03*
Y15748000D02*
D03*
Y16002000D02*
D03*
Y12192000D02*
D03*
Y12446000D02*
D03*
Y12700000D02*
D03*
Y12953999D02*
D03*
Y13208000D02*
D03*
Y13462000D02*
D03*
Y13716000D02*
D03*
Y13970000D02*
D03*
Y10160000D02*
D03*
Y10414000D02*
D03*
Y10668000D02*
D03*
Y10922000D02*
D03*
Y11176000D02*
D03*
Y11430000D02*
D03*
Y11684000D02*
D03*
Y11938000D02*
D03*
X17272000D02*
D03*
Y11684000D02*
D03*
Y11430000D02*
D03*
Y11176000D02*
D03*
Y10922000D02*
D03*
Y10668000D02*
D03*
Y10414000D02*
D03*
Y10160000D02*
D03*
Y13970000D02*
D03*
Y13716000D02*
D03*
Y13462000D02*
D03*
Y13208000D02*
D03*
Y12953999D02*
D03*
Y12700000D02*
D03*
Y12446000D02*
D03*
Y12192000D02*
D03*
Y16002000D02*
D03*
Y15748000D02*
D03*
Y15494000D02*
D03*
Y15239999D02*
D03*
Y14986000D02*
D03*
Y14732001D02*
D03*
Y14478000D02*
D03*
Y14224001D02*
D03*
Y16256000D02*
D03*
Y16510001D02*
D03*
Y16764000D02*
D03*
Y17017999D02*
D03*
Y17272000D02*
D03*
Y17525999D02*
D03*
Y17780000D02*
D03*
Y18034000D02*
D03*
X17780000D02*
D03*
Y17780000D02*
D03*
Y17525999D02*
D03*
Y17272000D02*
D03*
Y17017999D02*
D03*
Y16764000D02*
D03*
Y16510001D02*
D03*
Y16256000D02*
D03*
Y14224001D02*
D03*
Y14478000D02*
D03*
Y14732001D02*
D03*
Y14986000D02*
D03*
Y15239999D02*
D03*
Y15494000D02*
D03*
Y15748000D02*
D03*
Y16002000D02*
D03*
Y12192000D02*
D03*
Y12446000D02*
D03*
Y12700000D02*
D03*
Y12953999D02*
D03*
Y13208000D02*
D03*
Y13462000D02*
D03*
Y13716000D02*
D03*
Y13970000D02*
D03*
Y10160000D02*
D03*
Y10414000D02*
D03*
Y10668000D02*
D03*
Y10922000D02*
D03*
Y11176000D02*
D03*
Y11430000D02*
D03*
Y11684000D02*
D03*
Y11938000D02*
D03*
X14224001D02*
D03*
Y11684000D02*
D03*
Y11430000D02*
D03*
Y11176000D02*
D03*
Y10922000D02*
D03*
Y10668000D02*
D03*
Y10414000D02*
D03*
Y10160000D02*
D03*
Y13970000D02*
D03*
Y13716000D02*
D03*
Y13462000D02*
D03*
Y13208000D02*
D03*
Y12953999D02*
D03*
Y12700000D02*
D03*
Y12446000D02*
D03*
Y12192000D02*
D03*
Y16002000D02*
D03*
Y15748000D02*
D03*
Y15494000D02*
D03*
Y15239999D02*
D03*
Y14986000D02*
D03*
Y14732001D02*
D03*
Y14478000D02*
D03*
Y14224001D02*
D03*
Y16256000D02*
D03*
Y16510001D02*
D03*
Y16764000D02*
D03*
Y17017999D02*
D03*
Y17272000D02*
D03*
Y17525999D02*
D03*
Y17780000D02*
D03*
Y18034000D02*
D03*
X14732001D02*
D03*
Y17780000D02*
D03*
Y17525999D02*
D03*
Y17272000D02*
D03*
Y17017999D02*
D03*
Y16764000D02*
D03*
Y16510001D02*
D03*
Y16256000D02*
D03*
Y14224001D02*
D03*
Y14478000D02*
D03*
Y14732001D02*
D03*
Y14986000D02*
D03*
Y15239999D02*
D03*
Y15494000D02*
D03*
Y15748000D02*
D03*
Y16002000D02*
D03*
Y12192000D02*
D03*
Y12446000D02*
D03*
Y12700000D02*
D03*
Y12953999D02*
D03*
Y13208000D02*
D03*
Y13462000D02*
D03*
Y13716000D02*
D03*
Y13970000D02*
D03*
Y10160000D02*
D03*
Y10414000D02*
D03*
Y10668000D02*
D03*
Y10922000D02*
D03*
Y11176000D02*
D03*
Y11430000D02*
D03*
Y11684000D02*
D03*
Y11938000D02*
D03*
D21*
X8352000Y18597000D02*
D03*
Y9596995D02*
D03*
X17496001Y18597000D02*
D03*
Y9596995D02*
D03*
X14448000Y18597000D02*
D03*
Y9596995D02*
D03*
D22*
X19812000Y10058400D02*
D03*
Y10693401D02*
D03*
D26*
X28932748Y7980001D02*
D03*
D27*
X28932751Y20203751D02*
D03*
D28*
X49529999Y9096375D02*
D03*
%TF.MD5,b555c7d1e34b4821340f4223ba86a070*%
M02*
