%TF.GenerationSoftware,Altium Limited,Altium Designer,19.1.5 (86)*%
G04 Layer_Color=0*
%FSLAX45Y45*%
%MOMM*%
%TF.FileFunction,NonPlated,1,2,NPTH,Drill*%
%TF.Part,Single*%
G01*
G75*
%TA.AperFunction,ComponentDrill*%
%ADD44C,1.20000*%
D44*
X8128000Y13462000D02*
D03*
X8255000Y16128999D02*
D03*
X8128000Y10795000D02*
D03*
%TF.MD5,23a58f3f76bf05c835b62821c5cef5da*%
M02*
