%TF.GenerationSoftware,Altium Limited,Altium Designer,19.1.5 (86)*%
G04 Layer_Color=255*
%FSLAX45Y45*%
%MOMM*%
%TF.FileFunction,Pads,Top*%
%TF.Part,Single*%
G01*
G75*
%TA.AperFunction,ComponentPad*%
%ADD18C,3.50000*%
%ADD19C,1.70000*%
%TA.AperFunction,ViaPad*%
%ADD20C,4.45000*%
%TA.AperFunction,ComponentPad*%
%ADD21C,3.80000*%
%ADD22C,2.00000*%
%ADD23C,2.50000*%
%ADD24C,1.60000*%
%ADD25C,4.60000*%
D18*
X690090Y1935085D02*
D03*
Y10935090D02*
D03*
X690098Y15270085D02*
D03*
Y24270090D02*
D03*
X37266089D02*
D03*
Y15270085D02*
D03*
X33202090Y24270090D02*
D03*
Y15270085D02*
D03*
X29138089Y24270090D02*
D03*
Y15270085D02*
D03*
X25074091Y24270090D02*
D03*
Y15270085D02*
D03*
X21010091Y24270090D02*
D03*
Y15270085D02*
D03*
X16946091Y24270090D02*
D03*
Y15270085D02*
D03*
X12882091Y24270090D02*
D03*
Y15270085D02*
D03*
X8818090Y24270090D02*
D03*
Y15270085D02*
D03*
X4754090Y24270090D02*
D03*
Y15270085D02*
D03*
X37266089Y10935090D02*
D03*
Y1935085D02*
D03*
X33202090Y10935090D02*
D03*
Y1935085D02*
D03*
X29138089Y10935090D02*
D03*
Y1935085D02*
D03*
X25074091Y10935090D02*
D03*
Y1935085D02*
D03*
X21010091Y10935090D02*
D03*
Y1935085D02*
D03*
X16946091Y10935090D02*
D03*
Y1935085D02*
D03*
X12882091Y10935090D02*
D03*
Y1935085D02*
D03*
X8818090Y10935090D02*
D03*
Y1935085D02*
D03*
X4754090Y10935090D02*
D03*
Y1935085D02*
D03*
D19*
X974090Y4276090D02*
D03*
Y4022090D02*
D03*
Y3768090D02*
D03*
Y3514090D02*
D03*
Y3260090D02*
D03*
Y3006090D02*
D03*
Y2752090D02*
D03*
Y2498090D02*
D03*
Y6308090D02*
D03*
Y6054090D02*
D03*
Y5800090D02*
D03*
Y5546090D02*
D03*
Y5292090D02*
D03*
Y5038090D02*
D03*
Y4784090D02*
D03*
Y4530090D02*
D03*
Y8340090D02*
D03*
Y8086090D02*
D03*
Y7832090D02*
D03*
Y7578090D02*
D03*
Y7324090D02*
D03*
Y7070090D02*
D03*
Y6816090D02*
D03*
Y6562090D02*
D03*
Y8594090D02*
D03*
Y8848090D02*
D03*
Y9102090D02*
D03*
Y9356090D02*
D03*
Y9610090D02*
D03*
Y9864090D02*
D03*
Y10118090D02*
D03*
Y10372090D02*
D03*
X466090D02*
D03*
Y10118090D02*
D03*
Y9864090D02*
D03*
Y9610090D02*
D03*
Y9356090D02*
D03*
Y9102090D02*
D03*
Y8848090D02*
D03*
Y8594090D02*
D03*
Y6562090D02*
D03*
Y6816090D02*
D03*
Y7070090D02*
D03*
Y7324090D02*
D03*
Y7578090D02*
D03*
Y7832090D02*
D03*
Y8086090D02*
D03*
Y8340090D02*
D03*
Y4530090D02*
D03*
Y4784090D02*
D03*
Y5038090D02*
D03*
Y5292090D02*
D03*
Y5546090D02*
D03*
Y5800090D02*
D03*
Y6054090D02*
D03*
Y6308090D02*
D03*
Y2498090D02*
D03*
Y2752090D02*
D03*
Y3006090D02*
D03*
Y3260090D02*
D03*
Y3514090D02*
D03*
Y3768090D02*
D03*
Y4022090D02*
D03*
Y4276090D02*
D03*
X974098Y17611090D02*
D03*
Y17357091D02*
D03*
Y17103090D02*
D03*
Y16849091D02*
D03*
Y16595090D02*
D03*
Y16341090D02*
D03*
Y16087090D02*
D03*
Y15833090D02*
D03*
Y19643089D02*
D03*
Y19389090D02*
D03*
Y19135091D02*
D03*
Y18881090D02*
D03*
Y18627090D02*
D03*
Y18373090D02*
D03*
Y18119090D02*
D03*
Y17865089D02*
D03*
Y21675090D02*
D03*
Y21421091D02*
D03*
Y21167090D02*
D03*
Y20913091D02*
D03*
Y20659090D02*
D03*
Y20405090D02*
D03*
Y20151089D02*
D03*
Y19897090D02*
D03*
Y21929089D02*
D03*
Y22183090D02*
D03*
Y22437090D02*
D03*
Y22691090D02*
D03*
Y22945090D02*
D03*
Y23199091D02*
D03*
Y23453090D02*
D03*
Y23707091D02*
D03*
X466098D02*
D03*
Y23453090D02*
D03*
Y23199091D02*
D03*
Y22945090D02*
D03*
Y22691090D02*
D03*
Y22437090D02*
D03*
Y22183090D02*
D03*
Y21929089D02*
D03*
Y19897090D02*
D03*
Y20151089D02*
D03*
Y20405090D02*
D03*
Y20659090D02*
D03*
Y20913091D02*
D03*
Y21167090D02*
D03*
Y21421091D02*
D03*
Y21675090D02*
D03*
Y17865089D02*
D03*
Y18119090D02*
D03*
Y18373090D02*
D03*
Y18627090D02*
D03*
Y18881090D02*
D03*
Y19135091D02*
D03*
Y19389090D02*
D03*
Y19643089D02*
D03*
Y15833090D02*
D03*
Y16087090D02*
D03*
Y16341090D02*
D03*
Y16595090D02*
D03*
Y16849091D02*
D03*
Y17103090D02*
D03*
Y17357091D02*
D03*
Y17611090D02*
D03*
X37042090D02*
D03*
Y17357091D02*
D03*
Y17103090D02*
D03*
Y16849091D02*
D03*
Y16595090D02*
D03*
Y16341090D02*
D03*
Y16087090D02*
D03*
Y15833090D02*
D03*
Y19643089D02*
D03*
Y19389090D02*
D03*
Y19135091D02*
D03*
Y18881090D02*
D03*
Y18627090D02*
D03*
Y18373090D02*
D03*
Y18119090D02*
D03*
Y17865089D02*
D03*
Y21675090D02*
D03*
Y21421091D02*
D03*
Y21167090D02*
D03*
Y20913091D02*
D03*
Y20659090D02*
D03*
Y20405090D02*
D03*
Y20151089D02*
D03*
Y19897090D02*
D03*
Y21929089D02*
D03*
Y22183090D02*
D03*
Y22437090D02*
D03*
Y22691090D02*
D03*
Y22945090D02*
D03*
Y23199091D02*
D03*
Y23453090D02*
D03*
Y23707091D02*
D03*
X37550089D02*
D03*
Y23453090D02*
D03*
Y23199091D02*
D03*
Y22945090D02*
D03*
Y22691090D02*
D03*
Y22437090D02*
D03*
Y22183090D02*
D03*
Y21929089D02*
D03*
Y19897090D02*
D03*
Y20151089D02*
D03*
Y20405090D02*
D03*
Y20659090D02*
D03*
Y20913091D02*
D03*
Y21167090D02*
D03*
Y21421091D02*
D03*
Y21675090D02*
D03*
Y17865089D02*
D03*
Y18119090D02*
D03*
Y18373090D02*
D03*
Y18627090D02*
D03*
Y18881090D02*
D03*
Y19135091D02*
D03*
Y19389090D02*
D03*
Y19643089D02*
D03*
Y15833090D02*
D03*
Y16087090D02*
D03*
Y16341090D02*
D03*
Y16595090D02*
D03*
Y16849091D02*
D03*
Y17103090D02*
D03*
Y17357091D02*
D03*
Y17611090D02*
D03*
X32978091D02*
D03*
Y17357091D02*
D03*
Y17103090D02*
D03*
Y16849091D02*
D03*
Y16595090D02*
D03*
Y16341090D02*
D03*
Y16087090D02*
D03*
Y15833090D02*
D03*
Y19643089D02*
D03*
Y19389090D02*
D03*
Y19135091D02*
D03*
Y18881090D02*
D03*
Y18627090D02*
D03*
Y18373090D02*
D03*
Y18119090D02*
D03*
Y17865089D02*
D03*
Y21675090D02*
D03*
Y21421091D02*
D03*
Y21167090D02*
D03*
Y20913091D02*
D03*
Y20659090D02*
D03*
Y20405090D02*
D03*
Y20151089D02*
D03*
Y19897090D02*
D03*
Y21929089D02*
D03*
Y22183090D02*
D03*
Y22437090D02*
D03*
Y22691090D02*
D03*
Y22945090D02*
D03*
Y23199091D02*
D03*
Y23453090D02*
D03*
Y23707091D02*
D03*
X33486090D02*
D03*
Y23453090D02*
D03*
Y23199091D02*
D03*
Y22945090D02*
D03*
Y22691090D02*
D03*
Y22437090D02*
D03*
Y22183090D02*
D03*
Y21929089D02*
D03*
Y19897090D02*
D03*
Y20151089D02*
D03*
Y20405090D02*
D03*
Y20659090D02*
D03*
Y20913091D02*
D03*
Y21167090D02*
D03*
Y21421091D02*
D03*
Y21675090D02*
D03*
Y17865089D02*
D03*
Y18119090D02*
D03*
Y18373090D02*
D03*
Y18627090D02*
D03*
Y18881090D02*
D03*
Y19135091D02*
D03*
Y19389090D02*
D03*
Y19643089D02*
D03*
Y15833090D02*
D03*
Y16087090D02*
D03*
Y16341090D02*
D03*
Y16595090D02*
D03*
Y16849091D02*
D03*
Y17103090D02*
D03*
Y17357091D02*
D03*
Y17611090D02*
D03*
X28914090D02*
D03*
Y17357091D02*
D03*
Y17103090D02*
D03*
Y16849091D02*
D03*
Y16595090D02*
D03*
Y16341090D02*
D03*
Y16087090D02*
D03*
Y15833090D02*
D03*
Y19643089D02*
D03*
Y19389090D02*
D03*
Y19135091D02*
D03*
Y18881090D02*
D03*
Y18627090D02*
D03*
Y18373090D02*
D03*
Y18119090D02*
D03*
Y17865089D02*
D03*
Y21675090D02*
D03*
Y21421091D02*
D03*
Y21167090D02*
D03*
Y20913091D02*
D03*
Y20659090D02*
D03*
Y20405090D02*
D03*
Y20151089D02*
D03*
Y19897090D02*
D03*
Y21929089D02*
D03*
Y22183090D02*
D03*
Y22437090D02*
D03*
Y22691090D02*
D03*
Y22945090D02*
D03*
Y23199091D02*
D03*
Y23453090D02*
D03*
Y23707091D02*
D03*
X29422089D02*
D03*
Y23453090D02*
D03*
Y23199091D02*
D03*
Y22945090D02*
D03*
Y22691090D02*
D03*
Y22437090D02*
D03*
Y22183090D02*
D03*
Y21929089D02*
D03*
Y19897090D02*
D03*
Y20151089D02*
D03*
Y20405090D02*
D03*
Y20659090D02*
D03*
Y20913091D02*
D03*
Y21167090D02*
D03*
Y21421091D02*
D03*
Y21675090D02*
D03*
Y17865089D02*
D03*
Y18119090D02*
D03*
Y18373090D02*
D03*
Y18627090D02*
D03*
Y18881090D02*
D03*
Y19135091D02*
D03*
Y19389090D02*
D03*
Y19643089D02*
D03*
Y15833090D02*
D03*
Y16087090D02*
D03*
Y16341090D02*
D03*
Y16595090D02*
D03*
Y16849091D02*
D03*
Y17103090D02*
D03*
Y17357091D02*
D03*
Y17611090D02*
D03*
X24850090D02*
D03*
Y17357091D02*
D03*
Y17103090D02*
D03*
Y16849091D02*
D03*
Y16595090D02*
D03*
Y16341090D02*
D03*
Y16087090D02*
D03*
Y15833090D02*
D03*
Y19643089D02*
D03*
Y19389090D02*
D03*
Y19135091D02*
D03*
Y18881090D02*
D03*
Y18627090D02*
D03*
Y18373090D02*
D03*
Y18119090D02*
D03*
Y17865089D02*
D03*
Y21675090D02*
D03*
Y21421091D02*
D03*
Y21167090D02*
D03*
Y20913091D02*
D03*
Y20659090D02*
D03*
Y20405090D02*
D03*
Y20151089D02*
D03*
Y19897090D02*
D03*
Y21929089D02*
D03*
Y22183090D02*
D03*
Y22437090D02*
D03*
Y22691090D02*
D03*
Y22945090D02*
D03*
Y23199091D02*
D03*
Y23453090D02*
D03*
Y23707091D02*
D03*
X25358090D02*
D03*
Y23453090D02*
D03*
Y23199091D02*
D03*
Y22945090D02*
D03*
Y22691090D02*
D03*
Y22437090D02*
D03*
Y22183090D02*
D03*
Y21929089D02*
D03*
Y19897090D02*
D03*
Y20151089D02*
D03*
Y20405090D02*
D03*
Y20659090D02*
D03*
Y20913091D02*
D03*
Y21167090D02*
D03*
Y21421091D02*
D03*
Y21675090D02*
D03*
Y17865089D02*
D03*
Y18119090D02*
D03*
Y18373090D02*
D03*
Y18627090D02*
D03*
Y18881090D02*
D03*
Y19135091D02*
D03*
Y19389090D02*
D03*
Y19643089D02*
D03*
Y15833090D02*
D03*
Y16087090D02*
D03*
Y16341090D02*
D03*
Y16595090D02*
D03*
Y16849091D02*
D03*
Y17103090D02*
D03*
Y17357091D02*
D03*
Y17611090D02*
D03*
X20786090D02*
D03*
Y17357091D02*
D03*
Y17103090D02*
D03*
Y16849091D02*
D03*
Y16595090D02*
D03*
Y16341090D02*
D03*
Y16087090D02*
D03*
Y15833090D02*
D03*
Y19643089D02*
D03*
Y19389090D02*
D03*
Y19135091D02*
D03*
Y18881090D02*
D03*
Y18627090D02*
D03*
Y18373090D02*
D03*
Y18119090D02*
D03*
Y17865089D02*
D03*
Y21675090D02*
D03*
Y21421091D02*
D03*
Y21167090D02*
D03*
Y20913091D02*
D03*
Y20659090D02*
D03*
Y20405090D02*
D03*
Y20151089D02*
D03*
Y19897090D02*
D03*
Y21929089D02*
D03*
Y22183090D02*
D03*
Y22437090D02*
D03*
Y22691090D02*
D03*
Y22945090D02*
D03*
Y23199091D02*
D03*
Y23453090D02*
D03*
Y23707091D02*
D03*
X21294090D02*
D03*
Y23453090D02*
D03*
Y23199091D02*
D03*
Y22945090D02*
D03*
Y22691090D02*
D03*
Y22437090D02*
D03*
Y22183090D02*
D03*
Y21929089D02*
D03*
Y19897090D02*
D03*
Y20151089D02*
D03*
Y20405090D02*
D03*
Y20659090D02*
D03*
Y20913091D02*
D03*
Y21167090D02*
D03*
Y21421091D02*
D03*
Y21675090D02*
D03*
Y17865089D02*
D03*
Y18119090D02*
D03*
Y18373090D02*
D03*
Y18627090D02*
D03*
Y18881090D02*
D03*
Y19135091D02*
D03*
Y19389090D02*
D03*
Y19643089D02*
D03*
Y15833090D02*
D03*
Y16087090D02*
D03*
Y16341090D02*
D03*
Y16595090D02*
D03*
Y16849091D02*
D03*
Y17103090D02*
D03*
Y17357091D02*
D03*
Y17611090D02*
D03*
X16722090D02*
D03*
Y17357091D02*
D03*
Y17103090D02*
D03*
Y16849091D02*
D03*
Y16595090D02*
D03*
Y16341090D02*
D03*
Y16087090D02*
D03*
Y15833090D02*
D03*
Y19643089D02*
D03*
Y19389090D02*
D03*
Y19135091D02*
D03*
Y18881090D02*
D03*
Y18627090D02*
D03*
Y18373090D02*
D03*
Y18119090D02*
D03*
Y17865089D02*
D03*
Y21675090D02*
D03*
Y21421091D02*
D03*
Y21167090D02*
D03*
Y20913091D02*
D03*
Y20659090D02*
D03*
Y20405090D02*
D03*
Y20151089D02*
D03*
Y19897090D02*
D03*
Y21929089D02*
D03*
Y22183090D02*
D03*
Y22437090D02*
D03*
Y22691090D02*
D03*
Y22945090D02*
D03*
Y23199091D02*
D03*
Y23453090D02*
D03*
Y23707091D02*
D03*
X17230090D02*
D03*
Y23453090D02*
D03*
Y23199091D02*
D03*
Y22945090D02*
D03*
Y22691090D02*
D03*
Y22437090D02*
D03*
Y22183090D02*
D03*
Y21929089D02*
D03*
Y19897090D02*
D03*
Y20151089D02*
D03*
Y20405090D02*
D03*
Y20659090D02*
D03*
Y20913091D02*
D03*
Y21167090D02*
D03*
Y21421091D02*
D03*
Y21675090D02*
D03*
Y17865089D02*
D03*
Y18119090D02*
D03*
Y18373090D02*
D03*
Y18627090D02*
D03*
Y18881090D02*
D03*
Y19135091D02*
D03*
Y19389090D02*
D03*
Y19643089D02*
D03*
Y15833090D02*
D03*
Y16087090D02*
D03*
Y16341090D02*
D03*
Y16595090D02*
D03*
Y16849091D02*
D03*
Y17103090D02*
D03*
Y17357091D02*
D03*
Y17611090D02*
D03*
X12658090D02*
D03*
Y17357091D02*
D03*
Y17103090D02*
D03*
Y16849091D02*
D03*
Y16595090D02*
D03*
Y16341090D02*
D03*
Y16087090D02*
D03*
Y15833090D02*
D03*
Y19643089D02*
D03*
Y19389090D02*
D03*
Y19135091D02*
D03*
Y18881090D02*
D03*
Y18627090D02*
D03*
Y18373090D02*
D03*
Y18119090D02*
D03*
Y17865089D02*
D03*
Y21675090D02*
D03*
Y21421091D02*
D03*
Y21167090D02*
D03*
Y20913091D02*
D03*
Y20659090D02*
D03*
Y20405090D02*
D03*
Y20151089D02*
D03*
Y19897090D02*
D03*
Y21929089D02*
D03*
Y22183090D02*
D03*
Y22437090D02*
D03*
Y22691090D02*
D03*
Y22945090D02*
D03*
Y23199091D02*
D03*
Y23453090D02*
D03*
Y23707091D02*
D03*
X13166090D02*
D03*
Y23453090D02*
D03*
Y23199091D02*
D03*
Y22945090D02*
D03*
Y22691090D02*
D03*
Y22437090D02*
D03*
Y22183090D02*
D03*
Y21929089D02*
D03*
Y19897090D02*
D03*
Y20151089D02*
D03*
Y20405090D02*
D03*
Y20659090D02*
D03*
Y20913091D02*
D03*
Y21167090D02*
D03*
Y21421091D02*
D03*
Y21675090D02*
D03*
Y17865089D02*
D03*
Y18119090D02*
D03*
Y18373090D02*
D03*
Y18627090D02*
D03*
Y18881090D02*
D03*
Y19135091D02*
D03*
Y19389090D02*
D03*
Y19643089D02*
D03*
Y15833090D02*
D03*
Y16087090D02*
D03*
Y16341090D02*
D03*
Y16595090D02*
D03*
Y16849091D02*
D03*
Y17103090D02*
D03*
Y17357091D02*
D03*
Y17611090D02*
D03*
X8594090D02*
D03*
Y17357091D02*
D03*
Y17103090D02*
D03*
Y16849091D02*
D03*
Y16595090D02*
D03*
Y16341090D02*
D03*
Y16087090D02*
D03*
Y15833090D02*
D03*
Y19643089D02*
D03*
Y19389090D02*
D03*
Y19135091D02*
D03*
Y18881090D02*
D03*
Y18627090D02*
D03*
Y18373090D02*
D03*
Y18119090D02*
D03*
Y17865089D02*
D03*
Y21675090D02*
D03*
Y21421091D02*
D03*
Y21167090D02*
D03*
Y20913091D02*
D03*
Y20659090D02*
D03*
Y20405090D02*
D03*
Y20151089D02*
D03*
Y19897090D02*
D03*
Y21929089D02*
D03*
Y22183090D02*
D03*
Y22437090D02*
D03*
Y22691090D02*
D03*
Y22945090D02*
D03*
Y23199091D02*
D03*
Y23453090D02*
D03*
Y23707091D02*
D03*
X9102090D02*
D03*
Y23453090D02*
D03*
Y23199091D02*
D03*
Y22945090D02*
D03*
Y22691090D02*
D03*
Y22437090D02*
D03*
Y22183090D02*
D03*
Y21929089D02*
D03*
Y19897090D02*
D03*
Y20151089D02*
D03*
Y20405090D02*
D03*
Y20659090D02*
D03*
Y20913091D02*
D03*
Y21167090D02*
D03*
Y21421091D02*
D03*
Y21675090D02*
D03*
Y17865089D02*
D03*
Y18119090D02*
D03*
Y18373090D02*
D03*
Y18627090D02*
D03*
Y18881090D02*
D03*
Y19135091D02*
D03*
Y19389090D02*
D03*
Y19643089D02*
D03*
Y15833090D02*
D03*
Y16087090D02*
D03*
Y16341090D02*
D03*
Y16595090D02*
D03*
Y16849091D02*
D03*
Y17103090D02*
D03*
Y17357091D02*
D03*
Y17611090D02*
D03*
X4530090D02*
D03*
Y17357091D02*
D03*
Y17103090D02*
D03*
Y16849091D02*
D03*
Y16595090D02*
D03*
Y16341090D02*
D03*
Y16087090D02*
D03*
Y15833090D02*
D03*
Y19643089D02*
D03*
Y19389090D02*
D03*
Y19135091D02*
D03*
Y18881090D02*
D03*
Y18627090D02*
D03*
Y18373090D02*
D03*
Y18119090D02*
D03*
Y17865089D02*
D03*
Y21675090D02*
D03*
Y21421091D02*
D03*
Y21167090D02*
D03*
Y20913091D02*
D03*
Y20659090D02*
D03*
Y20405090D02*
D03*
Y20151089D02*
D03*
Y19897090D02*
D03*
Y21929089D02*
D03*
Y22183090D02*
D03*
Y22437090D02*
D03*
Y22691090D02*
D03*
Y22945090D02*
D03*
Y23199091D02*
D03*
Y23453090D02*
D03*
Y23707091D02*
D03*
X5038090D02*
D03*
Y23453090D02*
D03*
Y23199091D02*
D03*
Y22945090D02*
D03*
Y22691090D02*
D03*
Y22437090D02*
D03*
Y22183090D02*
D03*
Y21929089D02*
D03*
Y19897090D02*
D03*
Y20151089D02*
D03*
Y20405090D02*
D03*
Y20659090D02*
D03*
Y20913091D02*
D03*
Y21167090D02*
D03*
Y21421091D02*
D03*
Y21675090D02*
D03*
Y17865089D02*
D03*
Y18119090D02*
D03*
Y18373090D02*
D03*
Y18627090D02*
D03*
Y18881090D02*
D03*
Y19135091D02*
D03*
Y19389090D02*
D03*
Y19643089D02*
D03*
Y15833090D02*
D03*
Y16087090D02*
D03*
Y16341090D02*
D03*
Y16595090D02*
D03*
Y16849091D02*
D03*
Y17103090D02*
D03*
Y17357091D02*
D03*
Y17611090D02*
D03*
X37042090Y4276090D02*
D03*
Y4022090D02*
D03*
Y3768090D02*
D03*
Y3514090D02*
D03*
Y3260090D02*
D03*
Y3006090D02*
D03*
Y2752090D02*
D03*
Y2498090D02*
D03*
Y6308090D02*
D03*
Y6054090D02*
D03*
Y5800090D02*
D03*
Y5546090D02*
D03*
Y5292090D02*
D03*
Y5038090D02*
D03*
Y4784090D02*
D03*
Y4530090D02*
D03*
Y8340090D02*
D03*
Y8086090D02*
D03*
Y7832090D02*
D03*
Y7578090D02*
D03*
Y7324090D02*
D03*
Y7070090D02*
D03*
Y6816090D02*
D03*
Y6562090D02*
D03*
Y8594090D02*
D03*
Y8848090D02*
D03*
Y9102090D02*
D03*
Y9356090D02*
D03*
Y9610090D02*
D03*
Y9864090D02*
D03*
Y10118090D02*
D03*
Y10372090D02*
D03*
X37550089D02*
D03*
Y10118090D02*
D03*
Y9864090D02*
D03*
Y9610090D02*
D03*
Y9356090D02*
D03*
Y9102090D02*
D03*
Y8848090D02*
D03*
Y8594090D02*
D03*
Y6562090D02*
D03*
Y6816090D02*
D03*
Y7070090D02*
D03*
Y7324090D02*
D03*
Y7578090D02*
D03*
Y7832090D02*
D03*
Y8086090D02*
D03*
Y8340090D02*
D03*
Y4530090D02*
D03*
Y4784090D02*
D03*
Y5038090D02*
D03*
Y5292090D02*
D03*
Y5546090D02*
D03*
Y5800090D02*
D03*
Y6054090D02*
D03*
Y6308090D02*
D03*
Y2498090D02*
D03*
Y2752090D02*
D03*
Y3006090D02*
D03*
Y3260090D02*
D03*
Y3514090D02*
D03*
Y3768090D02*
D03*
Y4022090D02*
D03*
Y4276090D02*
D03*
X32978091D02*
D03*
Y4022090D02*
D03*
Y3768090D02*
D03*
Y3514090D02*
D03*
Y3260090D02*
D03*
Y3006090D02*
D03*
Y2752090D02*
D03*
Y2498090D02*
D03*
Y6308090D02*
D03*
Y6054090D02*
D03*
Y5800090D02*
D03*
Y5546090D02*
D03*
Y5292090D02*
D03*
Y5038090D02*
D03*
Y4784090D02*
D03*
Y4530090D02*
D03*
Y8340090D02*
D03*
Y8086090D02*
D03*
Y7832090D02*
D03*
Y7578090D02*
D03*
Y7324090D02*
D03*
Y7070090D02*
D03*
Y6816090D02*
D03*
Y6562090D02*
D03*
Y8594090D02*
D03*
Y8848090D02*
D03*
Y9102090D02*
D03*
Y9356090D02*
D03*
Y9610090D02*
D03*
Y9864090D02*
D03*
Y10118090D02*
D03*
Y10372090D02*
D03*
X33486090D02*
D03*
Y10118090D02*
D03*
Y9864090D02*
D03*
Y9610090D02*
D03*
Y9356090D02*
D03*
Y9102090D02*
D03*
Y8848090D02*
D03*
Y8594090D02*
D03*
Y6562090D02*
D03*
Y6816090D02*
D03*
Y7070090D02*
D03*
Y7324090D02*
D03*
Y7578090D02*
D03*
Y7832090D02*
D03*
Y8086090D02*
D03*
Y8340090D02*
D03*
Y4530090D02*
D03*
Y4784090D02*
D03*
Y5038090D02*
D03*
Y5292090D02*
D03*
Y5546090D02*
D03*
Y5800090D02*
D03*
Y6054090D02*
D03*
Y6308090D02*
D03*
Y2498090D02*
D03*
Y2752090D02*
D03*
Y3006090D02*
D03*
Y3260090D02*
D03*
Y3514090D02*
D03*
Y3768090D02*
D03*
Y4022090D02*
D03*
Y4276090D02*
D03*
X28914090D02*
D03*
Y4022090D02*
D03*
Y3768090D02*
D03*
Y3514090D02*
D03*
Y3260090D02*
D03*
Y3006090D02*
D03*
Y2752090D02*
D03*
Y2498090D02*
D03*
Y6308090D02*
D03*
Y6054090D02*
D03*
Y5800090D02*
D03*
Y5546090D02*
D03*
Y5292090D02*
D03*
Y5038090D02*
D03*
Y4784090D02*
D03*
Y4530090D02*
D03*
Y8340090D02*
D03*
Y8086090D02*
D03*
Y7832090D02*
D03*
Y7578090D02*
D03*
Y7324090D02*
D03*
Y7070090D02*
D03*
Y6816090D02*
D03*
Y6562090D02*
D03*
Y8594090D02*
D03*
Y8848090D02*
D03*
Y9102090D02*
D03*
Y9356090D02*
D03*
Y9610090D02*
D03*
Y9864090D02*
D03*
Y10118090D02*
D03*
Y10372090D02*
D03*
X29422089D02*
D03*
Y10118090D02*
D03*
Y9864090D02*
D03*
Y9610090D02*
D03*
Y9356090D02*
D03*
Y9102090D02*
D03*
Y8848090D02*
D03*
Y8594090D02*
D03*
Y6562090D02*
D03*
Y6816090D02*
D03*
Y7070090D02*
D03*
Y7324090D02*
D03*
Y7578090D02*
D03*
Y7832090D02*
D03*
Y8086090D02*
D03*
Y8340090D02*
D03*
Y4530090D02*
D03*
Y4784090D02*
D03*
Y5038090D02*
D03*
Y5292090D02*
D03*
Y5546090D02*
D03*
Y5800090D02*
D03*
Y6054090D02*
D03*
Y6308090D02*
D03*
Y2498090D02*
D03*
Y2752090D02*
D03*
Y3006090D02*
D03*
Y3260090D02*
D03*
Y3514090D02*
D03*
Y3768090D02*
D03*
Y4022090D02*
D03*
Y4276090D02*
D03*
X24850090D02*
D03*
Y4022090D02*
D03*
Y3768090D02*
D03*
Y3514090D02*
D03*
Y3260090D02*
D03*
Y3006090D02*
D03*
Y2752090D02*
D03*
Y2498090D02*
D03*
Y6308090D02*
D03*
Y6054090D02*
D03*
Y5800090D02*
D03*
Y5546090D02*
D03*
Y5292090D02*
D03*
Y5038090D02*
D03*
Y4784090D02*
D03*
Y4530090D02*
D03*
Y8340090D02*
D03*
Y8086090D02*
D03*
Y7832090D02*
D03*
Y7578090D02*
D03*
Y7324090D02*
D03*
Y7070090D02*
D03*
Y6816090D02*
D03*
Y6562090D02*
D03*
Y8594090D02*
D03*
Y8848090D02*
D03*
Y9102090D02*
D03*
Y9356090D02*
D03*
Y9610090D02*
D03*
Y9864090D02*
D03*
Y10118090D02*
D03*
Y10372090D02*
D03*
X25358090D02*
D03*
Y10118090D02*
D03*
Y9864090D02*
D03*
Y9610090D02*
D03*
Y9356090D02*
D03*
Y9102090D02*
D03*
Y8848090D02*
D03*
Y8594090D02*
D03*
Y6562090D02*
D03*
Y6816090D02*
D03*
Y7070090D02*
D03*
Y7324090D02*
D03*
Y7578090D02*
D03*
Y7832090D02*
D03*
Y8086090D02*
D03*
Y8340090D02*
D03*
Y4530090D02*
D03*
Y4784090D02*
D03*
Y5038090D02*
D03*
Y5292090D02*
D03*
Y5546090D02*
D03*
Y5800090D02*
D03*
Y6054090D02*
D03*
Y6308090D02*
D03*
Y2498090D02*
D03*
Y2752090D02*
D03*
Y3006090D02*
D03*
Y3260090D02*
D03*
Y3514090D02*
D03*
Y3768090D02*
D03*
Y4022090D02*
D03*
Y4276090D02*
D03*
X20786090D02*
D03*
Y4022090D02*
D03*
Y3768090D02*
D03*
Y3514090D02*
D03*
Y3260090D02*
D03*
Y3006090D02*
D03*
Y2752090D02*
D03*
Y2498090D02*
D03*
Y6308090D02*
D03*
Y6054090D02*
D03*
Y5800090D02*
D03*
Y5546090D02*
D03*
Y5292090D02*
D03*
Y5038090D02*
D03*
Y4784090D02*
D03*
Y4530090D02*
D03*
Y8340090D02*
D03*
Y8086090D02*
D03*
Y7832090D02*
D03*
Y7578090D02*
D03*
Y7324090D02*
D03*
Y7070090D02*
D03*
Y6816090D02*
D03*
Y6562090D02*
D03*
Y8594090D02*
D03*
Y8848090D02*
D03*
Y9102090D02*
D03*
Y9356090D02*
D03*
Y9610090D02*
D03*
Y9864090D02*
D03*
Y10118090D02*
D03*
Y10372090D02*
D03*
X21294090D02*
D03*
Y10118090D02*
D03*
Y9864090D02*
D03*
Y9610090D02*
D03*
Y9356090D02*
D03*
Y9102090D02*
D03*
Y8848090D02*
D03*
Y8594090D02*
D03*
Y6562090D02*
D03*
Y6816090D02*
D03*
Y7070090D02*
D03*
Y7324090D02*
D03*
Y7578090D02*
D03*
Y7832090D02*
D03*
Y8086090D02*
D03*
Y8340090D02*
D03*
Y4530090D02*
D03*
Y4784090D02*
D03*
Y5038090D02*
D03*
Y5292090D02*
D03*
Y5546090D02*
D03*
Y5800090D02*
D03*
Y6054090D02*
D03*
Y6308090D02*
D03*
Y2498090D02*
D03*
Y2752090D02*
D03*
Y3006090D02*
D03*
Y3260090D02*
D03*
Y3514090D02*
D03*
Y3768090D02*
D03*
Y4022090D02*
D03*
Y4276090D02*
D03*
X16722090D02*
D03*
Y4022090D02*
D03*
Y3768090D02*
D03*
Y3514090D02*
D03*
Y3260090D02*
D03*
Y3006090D02*
D03*
Y2752090D02*
D03*
Y2498090D02*
D03*
Y6308090D02*
D03*
Y6054090D02*
D03*
Y5800090D02*
D03*
Y5546090D02*
D03*
Y5292090D02*
D03*
Y5038090D02*
D03*
Y4784090D02*
D03*
Y4530090D02*
D03*
Y8340090D02*
D03*
Y8086090D02*
D03*
Y7832090D02*
D03*
Y7578090D02*
D03*
Y7324090D02*
D03*
Y7070090D02*
D03*
Y6816090D02*
D03*
Y6562090D02*
D03*
Y8594090D02*
D03*
Y8848090D02*
D03*
Y9102090D02*
D03*
Y9356090D02*
D03*
Y9610090D02*
D03*
Y9864090D02*
D03*
Y10118090D02*
D03*
Y10372090D02*
D03*
X17230090D02*
D03*
Y10118090D02*
D03*
Y9864090D02*
D03*
Y9610090D02*
D03*
Y9356090D02*
D03*
Y9102090D02*
D03*
Y8848090D02*
D03*
Y8594090D02*
D03*
Y6562090D02*
D03*
Y6816090D02*
D03*
Y7070090D02*
D03*
Y7324090D02*
D03*
Y7578090D02*
D03*
Y7832090D02*
D03*
Y8086090D02*
D03*
Y8340090D02*
D03*
Y4530090D02*
D03*
Y4784090D02*
D03*
Y5038090D02*
D03*
Y5292090D02*
D03*
Y5546090D02*
D03*
Y5800090D02*
D03*
Y6054090D02*
D03*
Y6308090D02*
D03*
Y2498090D02*
D03*
Y2752090D02*
D03*
Y3006090D02*
D03*
Y3260090D02*
D03*
Y3514090D02*
D03*
Y3768090D02*
D03*
Y4022090D02*
D03*
Y4276090D02*
D03*
X12658090D02*
D03*
Y4022090D02*
D03*
Y3768090D02*
D03*
Y3514090D02*
D03*
Y3260090D02*
D03*
Y3006090D02*
D03*
Y2752090D02*
D03*
Y2498090D02*
D03*
Y6308090D02*
D03*
Y6054090D02*
D03*
Y5800090D02*
D03*
Y5546090D02*
D03*
Y5292090D02*
D03*
Y5038090D02*
D03*
Y4784090D02*
D03*
Y4530090D02*
D03*
Y8340090D02*
D03*
Y8086090D02*
D03*
Y7832090D02*
D03*
Y7578090D02*
D03*
Y7324090D02*
D03*
Y7070090D02*
D03*
Y6816090D02*
D03*
Y6562090D02*
D03*
Y8594090D02*
D03*
Y8848090D02*
D03*
Y9102090D02*
D03*
Y9356090D02*
D03*
Y9610090D02*
D03*
Y9864090D02*
D03*
Y10118090D02*
D03*
Y10372090D02*
D03*
X13166090D02*
D03*
Y10118090D02*
D03*
Y9864090D02*
D03*
Y9610090D02*
D03*
Y9356090D02*
D03*
Y9102090D02*
D03*
Y8848090D02*
D03*
Y8594090D02*
D03*
Y6562090D02*
D03*
Y6816090D02*
D03*
Y7070090D02*
D03*
Y7324090D02*
D03*
Y7578090D02*
D03*
Y7832090D02*
D03*
Y8086090D02*
D03*
Y8340090D02*
D03*
Y4530090D02*
D03*
Y4784090D02*
D03*
Y5038090D02*
D03*
Y5292090D02*
D03*
Y5546090D02*
D03*
Y5800090D02*
D03*
Y6054090D02*
D03*
Y6308090D02*
D03*
Y2498090D02*
D03*
Y2752090D02*
D03*
Y3006090D02*
D03*
Y3260090D02*
D03*
Y3514090D02*
D03*
Y3768090D02*
D03*
Y4022090D02*
D03*
Y4276090D02*
D03*
X8594090D02*
D03*
Y4022090D02*
D03*
Y3768090D02*
D03*
Y3514090D02*
D03*
Y3260090D02*
D03*
Y3006090D02*
D03*
Y2752090D02*
D03*
Y2498090D02*
D03*
Y6308090D02*
D03*
Y6054090D02*
D03*
Y5800090D02*
D03*
Y5546090D02*
D03*
Y5292090D02*
D03*
Y5038090D02*
D03*
Y4784090D02*
D03*
Y4530090D02*
D03*
Y8340090D02*
D03*
Y8086090D02*
D03*
Y7832090D02*
D03*
Y7578090D02*
D03*
Y7324090D02*
D03*
Y7070090D02*
D03*
Y6816090D02*
D03*
Y6562090D02*
D03*
Y8594090D02*
D03*
Y8848090D02*
D03*
Y9102090D02*
D03*
Y9356090D02*
D03*
Y9610090D02*
D03*
Y9864090D02*
D03*
Y10118090D02*
D03*
Y10372090D02*
D03*
X9102090D02*
D03*
Y10118090D02*
D03*
Y9864090D02*
D03*
Y9610090D02*
D03*
Y9356090D02*
D03*
Y9102090D02*
D03*
Y8848090D02*
D03*
Y8594090D02*
D03*
Y6562090D02*
D03*
Y6816090D02*
D03*
Y7070090D02*
D03*
Y7324090D02*
D03*
Y7578090D02*
D03*
Y7832090D02*
D03*
Y8086090D02*
D03*
Y8340090D02*
D03*
Y4530090D02*
D03*
Y4784090D02*
D03*
Y5038090D02*
D03*
Y5292090D02*
D03*
Y5546090D02*
D03*
Y5800090D02*
D03*
Y6054090D02*
D03*
Y6308090D02*
D03*
Y2498090D02*
D03*
Y2752090D02*
D03*
Y3006090D02*
D03*
Y3260090D02*
D03*
Y3514090D02*
D03*
Y3768090D02*
D03*
Y4022090D02*
D03*
Y4276090D02*
D03*
X4530090D02*
D03*
Y4022090D02*
D03*
Y3768090D02*
D03*
Y3514090D02*
D03*
Y3260090D02*
D03*
Y3006090D02*
D03*
Y2752090D02*
D03*
Y2498090D02*
D03*
Y6308090D02*
D03*
Y6054090D02*
D03*
Y5800090D02*
D03*
Y5546090D02*
D03*
Y5292090D02*
D03*
Y5038090D02*
D03*
Y4784090D02*
D03*
Y4530090D02*
D03*
Y8340090D02*
D03*
Y8086090D02*
D03*
Y7832090D02*
D03*
Y7578090D02*
D03*
Y7324090D02*
D03*
Y7070090D02*
D03*
Y6816090D02*
D03*
Y6562090D02*
D03*
Y8594090D02*
D03*
Y8848090D02*
D03*
Y9102090D02*
D03*
Y9356090D02*
D03*
Y9610090D02*
D03*
Y9864090D02*
D03*
Y10118090D02*
D03*
Y10372090D02*
D03*
X5038090D02*
D03*
Y10118090D02*
D03*
Y9864090D02*
D03*
Y9610090D02*
D03*
Y9356090D02*
D03*
Y9102090D02*
D03*
Y8848090D02*
D03*
Y8594090D02*
D03*
Y6562090D02*
D03*
Y6816090D02*
D03*
Y7070090D02*
D03*
Y7324090D02*
D03*
Y7578090D02*
D03*
Y7832090D02*
D03*
Y8086090D02*
D03*
Y8340090D02*
D03*
Y4530090D02*
D03*
Y4784090D02*
D03*
Y5038090D02*
D03*
Y5292090D02*
D03*
Y5546090D02*
D03*
Y5800090D02*
D03*
Y6054090D02*
D03*
Y6308090D02*
D03*
Y2498090D02*
D03*
Y2752090D02*
D03*
Y3006090D02*
D03*
Y3260090D02*
D03*
Y3514090D02*
D03*
Y3768090D02*
D03*
Y4022090D02*
D03*
Y4276090D02*
D03*
D20*
X25074091Y25895093D02*
D03*
X4754002D02*
D03*
X8818005D02*
D03*
X12882007D02*
D03*
X16946008D02*
D03*
X21010011D02*
D03*
X29138016D02*
D03*
X33202090D02*
D03*
X37266089D02*
D03*
X41838000D02*
D03*
X41842279Y310000D02*
D03*
X4754002D02*
D03*
X8818005D02*
D03*
X12882007D02*
D03*
X16946008D02*
D03*
X21010011D02*
D03*
X25074014D02*
D03*
X29138016D02*
D03*
X33202090D02*
D03*
X37266089D02*
D03*
X690097Y310077D02*
D03*
Y25895090D02*
D03*
D21*
X38607999Y6516900D02*
D03*
Y7726900D02*
D03*
X34544000Y6516900D02*
D03*
Y7726900D02*
D03*
X30607001Y6516900D02*
D03*
Y7726900D02*
D03*
X26416000Y6516900D02*
D03*
Y7726900D02*
D03*
X22606000Y6516900D02*
D03*
Y7726900D02*
D03*
X15684500Y6516900D02*
D03*
Y7726900D02*
D03*
X14251399Y6516900D02*
D03*
Y7726900D02*
D03*
X10415999Y6516900D02*
D03*
Y7726900D02*
D03*
X6313899Y6516900D02*
D03*
Y7726900D02*
D03*
X2199099Y6516900D02*
D03*
Y7726900D02*
D03*
X19060699Y12444200D02*
D03*
Y7734200D02*
D03*
X40081201Y12444200D02*
D03*
Y7734200D02*
D03*
D22*
X38607999Y7296900D02*
D03*
Y6946900D02*
D03*
X34544000Y7296900D02*
D03*
Y6946900D02*
D03*
X30607001Y7296900D02*
D03*
Y6946900D02*
D03*
X26416000Y7296900D02*
D03*
Y6946900D02*
D03*
X22606000Y7296900D02*
D03*
Y6946900D02*
D03*
X15684500Y7296900D02*
D03*
Y6946900D02*
D03*
X14251399Y7296900D02*
D03*
Y6946900D02*
D03*
X10415999Y7296900D02*
D03*
Y6946900D02*
D03*
X6313899Y7296900D02*
D03*
Y6946900D02*
D03*
X2199099Y7296900D02*
D03*
Y6946900D02*
D03*
X19060699Y8164200D02*
D03*
Y8514200D02*
D03*
Y8864200D02*
D03*
Y9214200D02*
D03*
Y9564200D02*
D03*
Y9914200D02*
D03*
Y10264200D02*
D03*
Y10614200D02*
D03*
Y11664200D02*
D03*
Y12014200D02*
D03*
Y11314200D02*
D03*
Y10964200D02*
D03*
X40081201Y8164200D02*
D03*
Y8514200D02*
D03*
Y8864200D02*
D03*
Y9214200D02*
D03*
Y9564200D02*
D03*
Y9914200D02*
D03*
Y10264200D02*
D03*
Y10614200D02*
D03*
Y11664200D02*
D03*
Y12014200D02*
D03*
Y11314200D02*
D03*
Y10964200D02*
D03*
D23*
X40055801Y5600700D02*
D03*
Y4965700D02*
D03*
Y3136900D02*
D03*
Y2501900D02*
D03*
X18966708Y5478780D02*
D03*
Y4843780D02*
D03*
X19031693Y3136900D02*
D03*
Y2501900D02*
D03*
D24*
X39326288Y15833089D02*
D03*
X39072290D02*
D03*
X39326288Y16087088D02*
D03*
X39072290D02*
D03*
X39326288Y16341087D02*
D03*
X39072290D02*
D03*
X39326288Y16595088D02*
D03*
X39072290D02*
D03*
X39326288Y16849089D02*
D03*
X39072290D02*
D03*
X39326288Y17103088D02*
D03*
X39072290D02*
D03*
X39326288Y17357089D02*
D03*
X39072290D02*
D03*
Y17611089D02*
D03*
X39326288D02*
D03*
X39072290Y17865089D02*
D03*
X39326288D02*
D03*
X39072290Y18119089D02*
D03*
X39326288D02*
D03*
X39072290Y18373090D02*
D03*
X39326288D02*
D03*
X39072290Y18627089D02*
D03*
X39326288D02*
D03*
X39072290Y18881088D02*
D03*
X39326288D02*
D03*
X39072290Y19135091D02*
D03*
X39326288D02*
D03*
X39072290Y19389090D02*
D03*
X39326288D02*
D03*
X39072290Y22183092D02*
D03*
X39326288D02*
D03*
X39072290Y22437093D02*
D03*
X39326288D02*
D03*
Y23199092D02*
D03*
Y22691092D02*
D03*
X39072290D02*
D03*
Y22945091D02*
D03*
X39326288D02*
D03*
X39072290Y23199092D02*
D03*
Y23453091D02*
D03*
X39326288D02*
D03*
X39072290Y23707092D02*
D03*
X39326288D02*
D03*
Y21929092D02*
D03*
X39072290D02*
D03*
X39326288Y21675092D02*
D03*
X39072290D02*
D03*
X39326288Y21421091D02*
D03*
X39072290D02*
D03*
Y21167091D02*
D03*
X39326288Y20913091D02*
D03*
X39072290D02*
D03*
Y20659091D02*
D03*
X39326288D02*
D03*
Y21167091D02*
D03*
Y20405090D02*
D03*
X39072290D02*
D03*
X39326288Y20151089D02*
D03*
X39072290D02*
D03*
Y19897090D02*
D03*
X39326288Y19643089D02*
D03*
X39072290D02*
D03*
X39326288Y19897090D02*
D03*
X35262289Y15833089D02*
D03*
X35008289D02*
D03*
X35262289Y16087088D02*
D03*
X35008289D02*
D03*
X35262289Y16341087D02*
D03*
X35008289D02*
D03*
X35262289Y16595088D02*
D03*
X35008289D02*
D03*
X35262289Y16849089D02*
D03*
X35008289D02*
D03*
X35262289Y17103088D02*
D03*
X35008289D02*
D03*
X35262289Y17357089D02*
D03*
X35008289D02*
D03*
Y17611089D02*
D03*
X35262289D02*
D03*
X35008289Y17865089D02*
D03*
X35262289D02*
D03*
X35008289Y18119089D02*
D03*
X35262289D02*
D03*
X35008289Y18373090D02*
D03*
X35262289D02*
D03*
X35008289Y18627089D02*
D03*
X35262289D02*
D03*
X35008289Y18881088D02*
D03*
X35262289D02*
D03*
X35008289Y19135091D02*
D03*
X35262289D02*
D03*
X35008289Y19389090D02*
D03*
X35262289D02*
D03*
X35008289Y22183092D02*
D03*
X35262289D02*
D03*
X35008289Y22437093D02*
D03*
X35262289D02*
D03*
Y23199092D02*
D03*
Y22691092D02*
D03*
X35008289D02*
D03*
Y22945091D02*
D03*
X35262289D02*
D03*
X35008289Y23199092D02*
D03*
Y23453091D02*
D03*
X35262289D02*
D03*
X35008289Y23707092D02*
D03*
X35262289D02*
D03*
Y21929092D02*
D03*
X35008289D02*
D03*
X35262289Y21675092D02*
D03*
X35008289D02*
D03*
X35262289Y21421091D02*
D03*
X35008289D02*
D03*
Y21167091D02*
D03*
X35262289Y20913091D02*
D03*
X35008289D02*
D03*
Y20659091D02*
D03*
X35262289D02*
D03*
Y21167091D02*
D03*
Y20405090D02*
D03*
X35008289D02*
D03*
X35262289Y20151089D02*
D03*
X35008289D02*
D03*
Y19897090D02*
D03*
X35262289Y19643089D02*
D03*
X35008289D02*
D03*
X35262289Y19897090D02*
D03*
X31198288Y15833089D02*
D03*
X30944290D02*
D03*
X31198288Y16087088D02*
D03*
X30944290D02*
D03*
X31198288Y16341087D02*
D03*
X30944290D02*
D03*
X31198288Y16595088D02*
D03*
X30944290D02*
D03*
X31198288Y16849089D02*
D03*
X30944290D02*
D03*
X31198288Y17103088D02*
D03*
X30944290D02*
D03*
X31198288Y17357089D02*
D03*
X30944290D02*
D03*
Y17611089D02*
D03*
X31198288D02*
D03*
X30944290Y17865089D02*
D03*
X31198288D02*
D03*
X30944290Y18119089D02*
D03*
X31198288D02*
D03*
X30944290Y18373090D02*
D03*
X31198288D02*
D03*
X30944290Y18627089D02*
D03*
X31198288D02*
D03*
X30944290Y18881088D02*
D03*
X31198288D02*
D03*
X30944290Y19135091D02*
D03*
X31198288D02*
D03*
X30944290Y19389090D02*
D03*
X31198288D02*
D03*
X30944290Y22183092D02*
D03*
X31198288D02*
D03*
X30944290Y22437093D02*
D03*
X31198288D02*
D03*
Y23199092D02*
D03*
Y22691092D02*
D03*
X30944290D02*
D03*
Y22945091D02*
D03*
X31198288D02*
D03*
X30944290Y23199092D02*
D03*
Y23453091D02*
D03*
X31198288D02*
D03*
X30944290Y23707092D02*
D03*
X31198288D02*
D03*
Y21929092D02*
D03*
X30944290D02*
D03*
X31198288Y21675092D02*
D03*
X30944290D02*
D03*
X31198288Y21421091D02*
D03*
X30944290D02*
D03*
Y21167091D02*
D03*
X31198288Y20913091D02*
D03*
X30944290D02*
D03*
Y20659091D02*
D03*
X31198288D02*
D03*
Y21167091D02*
D03*
Y20405090D02*
D03*
X30944290D02*
D03*
X31198288Y20151089D02*
D03*
X30944290D02*
D03*
Y19897090D02*
D03*
X31198288Y19643089D02*
D03*
X30944290D02*
D03*
X31198288Y19897090D02*
D03*
X27134290Y15833089D02*
D03*
X26880289D02*
D03*
X27134290Y16087088D02*
D03*
X26880289D02*
D03*
X27134290Y16341087D02*
D03*
X26880289D02*
D03*
X27134290Y16595088D02*
D03*
X26880289D02*
D03*
X27134290Y16849089D02*
D03*
X26880289D02*
D03*
X27134290Y17103088D02*
D03*
X26880289D02*
D03*
X27134290Y17357089D02*
D03*
X26880289D02*
D03*
Y17611089D02*
D03*
X27134290D02*
D03*
X26880289Y17865089D02*
D03*
X27134290D02*
D03*
X26880289Y18119089D02*
D03*
X27134290D02*
D03*
X26880289Y18373090D02*
D03*
X27134290D02*
D03*
X26880289Y18627089D02*
D03*
X27134290D02*
D03*
X26880289Y18881088D02*
D03*
X27134290D02*
D03*
X26880289Y19135091D02*
D03*
X27134290D02*
D03*
X26880289Y19389090D02*
D03*
X27134290D02*
D03*
X26880289Y22183092D02*
D03*
X27134290D02*
D03*
X26880289Y22437093D02*
D03*
X27134290D02*
D03*
Y23199092D02*
D03*
Y22691092D02*
D03*
X26880289D02*
D03*
Y22945091D02*
D03*
X27134290D02*
D03*
X26880289Y23199092D02*
D03*
Y23453091D02*
D03*
X27134290D02*
D03*
X26880289Y23707092D02*
D03*
X27134290D02*
D03*
Y21929092D02*
D03*
X26880289D02*
D03*
X27134290Y21675092D02*
D03*
X26880289D02*
D03*
X27134290Y21421091D02*
D03*
X26880289D02*
D03*
Y21167091D02*
D03*
X27134290Y20913091D02*
D03*
X26880289D02*
D03*
Y20659091D02*
D03*
X27134290D02*
D03*
Y21167091D02*
D03*
Y20405090D02*
D03*
X26880289D02*
D03*
X27134290Y20151089D02*
D03*
X26880289D02*
D03*
Y19897090D02*
D03*
X27134290Y19643089D02*
D03*
X26880289D02*
D03*
X27134290Y19897090D02*
D03*
X23070290Y15833089D02*
D03*
X22816289D02*
D03*
X23070290Y16087088D02*
D03*
X22816289D02*
D03*
X23070290Y16341087D02*
D03*
X22816289D02*
D03*
X23070290Y16595088D02*
D03*
X22816289D02*
D03*
X23070290Y16849089D02*
D03*
X22816289D02*
D03*
X23070290Y17103088D02*
D03*
X22816289D02*
D03*
X23070290Y17357089D02*
D03*
X22816289D02*
D03*
Y17611089D02*
D03*
X23070290D02*
D03*
X22816289Y17865089D02*
D03*
X23070290D02*
D03*
X22816289Y18119089D02*
D03*
X23070290D02*
D03*
X22816289Y18373090D02*
D03*
X23070290D02*
D03*
X22816289Y18627089D02*
D03*
X23070290D02*
D03*
X22816289Y18881088D02*
D03*
X23070290D02*
D03*
X22816289Y19135091D02*
D03*
X23070290D02*
D03*
X22816289Y19389090D02*
D03*
X23070290D02*
D03*
X22816289Y22183092D02*
D03*
X23070290D02*
D03*
X22816289Y22437093D02*
D03*
X23070290D02*
D03*
Y23199092D02*
D03*
Y22691092D02*
D03*
X22816289D02*
D03*
Y22945091D02*
D03*
X23070290D02*
D03*
X22816289Y23199092D02*
D03*
Y23453091D02*
D03*
X23070290D02*
D03*
X22816289Y23707092D02*
D03*
X23070290D02*
D03*
Y21929092D02*
D03*
X22816289D02*
D03*
X23070290Y21675092D02*
D03*
X22816289D02*
D03*
X23070290Y21421091D02*
D03*
X22816289D02*
D03*
Y21167091D02*
D03*
X23070290Y20913091D02*
D03*
X22816289D02*
D03*
Y20659091D02*
D03*
X23070290D02*
D03*
Y21167091D02*
D03*
Y20405090D02*
D03*
X22816289D02*
D03*
X23070290Y20151089D02*
D03*
X22816289D02*
D03*
Y19897090D02*
D03*
X23070290Y19643089D02*
D03*
X22816289D02*
D03*
X23070290Y19897090D02*
D03*
X19006290Y15833089D02*
D03*
X18752289D02*
D03*
X19006290Y16087088D02*
D03*
X18752289D02*
D03*
X19006290Y16341087D02*
D03*
X18752289D02*
D03*
X19006290Y16595088D02*
D03*
X18752289D02*
D03*
X19006290Y16849089D02*
D03*
X18752289D02*
D03*
X19006290Y17103088D02*
D03*
X18752289D02*
D03*
X19006290Y17357089D02*
D03*
X18752289D02*
D03*
Y17611089D02*
D03*
X19006290D02*
D03*
X18752289Y17865089D02*
D03*
X19006290D02*
D03*
X18752289Y18119089D02*
D03*
X19006290D02*
D03*
X18752289Y18373090D02*
D03*
X19006290D02*
D03*
X18752289Y18627089D02*
D03*
X19006290D02*
D03*
X18752289Y18881088D02*
D03*
X19006290D02*
D03*
X18752289Y19135091D02*
D03*
X19006290D02*
D03*
X18752289Y19389090D02*
D03*
X19006290D02*
D03*
X18752289Y22183092D02*
D03*
X19006290D02*
D03*
X18752289Y22437093D02*
D03*
X19006290D02*
D03*
Y23199092D02*
D03*
Y22691092D02*
D03*
X18752289D02*
D03*
Y22945091D02*
D03*
X19006290D02*
D03*
X18752289Y23199092D02*
D03*
Y23453091D02*
D03*
X19006290D02*
D03*
X18752289Y23707092D02*
D03*
X19006290D02*
D03*
Y21929092D02*
D03*
X18752289D02*
D03*
X19006290Y21675092D02*
D03*
X18752289D02*
D03*
X19006290Y21421091D02*
D03*
X18752289D02*
D03*
Y21167091D02*
D03*
X19006290Y20913091D02*
D03*
X18752289D02*
D03*
Y20659091D02*
D03*
X19006290D02*
D03*
Y21167091D02*
D03*
Y20405090D02*
D03*
X18752289D02*
D03*
X19006290Y20151089D02*
D03*
X18752289D02*
D03*
Y19897090D02*
D03*
X19006290Y19643089D02*
D03*
X18752289D02*
D03*
X19006290Y19897090D02*
D03*
X14942290Y15833089D02*
D03*
X14688289D02*
D03*
X14942290Y16087088D02*
D03*
X14688289D02*
D03*
X14942290Y16341087D02*
D03*
X14688289D02*
D03*
X14942290Y16595088D02*
D03*
X14688289D02*
D03*
X14942290Y16849089D02*
D03*
X14688289D02*
D03*
X14942290Y17103088D02*
D03*
X14688289D02*
D03*
X14942290Y17357089D02*
D03*
X14688289D02*
D03*
Y17611089D02*
D03*
X14942290D02*
D03*
X14688289Y17865089D02*
D03*
X14942290D02*
D03*
X14688289Y18119089D02*
D03*
X14942290D02*
D03*
X14688289Y18373090D02*
D03*
X14942290D02*
D03*
X14688289Y18627089D02*
D03*
X14942290D02*
D03*
X14688289Y18881088D02*
D03*
X14942290D02*
D03*
X14688289Y19135091D02*
D03*
X14942290D02*
D03*
X14688289Y19389090D02*
D03*
X14942290D02*
D03*
X14688289Y22183092D02*
D03*
X14942290D02*
D03*
X14688289Y22437093D02*
D03*
X14942290D02*
D03*
Y23199092D02*
D03*
Y22691092D02*
D03*
X14688289D02*
D03*
Y22945091D02*
D03*
X14942290D02*
D03*
X14688289Y23199092D02*
D03*
Y23453091D02*
D03*
X14942290D02*
D03*
X14688289Y23707092D02*
D03*
X14942290D02*
D03*
Y21929092D02*
D03*
X14688289D02*
D03*
X14942290Y21675092D02*
D03*
X14688289D02*
D03*
X14942290Y21421091D02*
D03*
X14688289D02*
D03*
Y21167091D02*
D03*
X14942290Y20913091D02*
D03*
X14688289D02*
D03*
Y20659091D02*
D03*
X14942290D02*
D03*
Y21167091D02*
D03*
Y20405090D02*
D03*
X14688289D02*
D03*
X14942290Y20151089D02*
D03*
X14688289D02*
D03*
Y19897090D02*
D03*
X14942290Y19643089D02*
D03*
X14688289D02*
D03*
X14942290Y19897090D02*
D03*
X10878289Y15833089D02*
D03*
X10624289D02*
D03*
X10878289Y16087088D02*
D03*
X10624289D02*
D03*
X10878289Y16341087D02*
D03*
X10624289D02*
D03*
X10878289Y16595088D02*
D03*
X10624289D02*
D03*
X10878289Y16849089D02*
D03*
X10624289D02*
D03*
X10878289Y17103088D02*
D03*
X10624289D02*
D03*
X10878289Y17357089D02*
D03*
X10624289D02*
D03*
Y17611089D02*
D03*
X10878289D02*
D03*
X10624289Y17865089D02*
D03*
X10878289D02*
D03*
X10624289Y18119089D02*
D03*
X10878289D02*
D03*
X10624289Y18373090D02*
D03*
X10878289D02*
D03*
X10624289Y18627089D02*
D03*
X10878289D02*
D03*
X10624289Y18881088D02*
D03*
X10878289D02*
D03*
X10624289Y19135091D02*
D03*
X10878289D02*
D03*
X10624289Y19389090D02*
D03*
X10878289D02*
D03*
X10624289Y22183092D02*
D03*
X10878289D02*
D03*
X10624289Y22437093D02*
D03*
X10878289D02*
D03*
Y23199092D02*
D03*
Y22691092D02*
D03*
X10624289D02*
D03*
Y22945091D02*
D03*
X10878289D02*
D03*
X10624289Y23199092D02*
D03*
Y23453091D02*
D03*
X10878289D02*
D03*
X10624289Y23707092D02*
D03*
X10878289D02*
D03*
Y21929092D02*
D03*
X10624289D02*
D03*
X10878289Y21675092D02*
D03*
X10624289D02*
D03*
X10878289Y21421091D02*
D03*
X10624289D02*
D03*
Y21167091D02*
D03*
X10878289Y20913091D02*
D03*
X10624289D02*
D03*
Y20659091D02*
D03*
X10878289D02*
D03*
Y21167091D02*
D03*
Y20405090D02*
D03*
X10624289D02*
D03*
X10878289Y20151089D02*
D03*
X10624289D02*
D03*
Y19897090D02*
D03*
X10878289Y19643089D02*
D03*
X10624289D02*
D03*
X10878289Y19897090D02*
D03*
X6813527Y15833089D02*
D03*
X6559527D02*
D03*
X6813527Y16087088D02*
D03*
X6559527D02*
D03*
X6813527Y16341087D02*
D03*
X6559527D02*
D03*
X6813527Y16595088D02*
D03*
X6559527D02*
D03*
X6813527Y16849089D02*
D03*
X6559527D02*
D03*
X6813527Y17103088D02*
D03*
X6559527D02*
D03*
X6813527Y17357089D02*
D03*
X6559527D02*
D03*
Y17611089D02*
D03*
X6813527D02*
D03*
X6559527Y17865089D02*
D03*
X6813527D02*
D03*
X6559527Y18119089D02*
D03*
X6813527D02*
D03*
X6559527Y18373090D02*
D03*
X6813527D02*
D03*
X6559527Y18627089D02*
D03*
X6813527D02*
D03*
X6559527Y18881088D02*
D03*
X6813527D02*
D03*
X6559527Y19135091D02*
D03*
X6813527D02*
D03*
X6559527Y19389090D02*
D03*
X6813527D02*
D03*
X6559527Y22183092D02*
D03*
X6813527D02*
D03*
X6559527Y22437093D02*
D03*
X6813527D02*
D03*
Y23199092D02*
D03*
Y22691092D02*
D03*
X6559527D02*
D03*
Y22945091D02*
D03*
X6813527D02*
D03*
X6559527Y23199092D02*
D03*
Y23453091D02*
D03*
X6813527D02*
D03*
X6559527Y23707092D02*
D03*
X6813527D02*
D03*
Y21929092D02*
D03*
X6559527D02*
D03*
X6813527Y21675092D02*
D03*
X6559527D02*
D03*
X6813527Y21421091D02*
D03*
X6559527D02*
D03*
Y21167091D02*
D03*
X6813527Y20913091D02*
D03*
X6559527D02*
D03*
Y20659091D02*
D03*
X6813527D02*
D03*
Y21167091D02*
D03*
Y20405090D02*
D03*
X6559527D02*
D03*
X6813527Y20151089D02*
D03*
X6559527D02*
D03*
Y19897090D02*
D03*
X6813527Y19643089D02*
D03*
X6559527D02*
D03*
X6813527Y19897090D02*
D03*
X2752090Y15833089D02*
D03*
X2498090D02*
D03*
X2752090Y16087088D02*
D03*
X2498090D02*
D03*
X2752090Y16341087D02*
D03*
X2498090D02*
D03*
X2752090Y16595088D02*
D03*
X2498090D02*
D03*
X2752090Y16849089D02*
D03*
X2498090D02*
D03*
X2752090Y17103088D02*
D03*
X2498090D02*
D03*
X2752090Y17357089D02*
D03*
X2498090D02*
D03*
Y17611089D02*
D03*
X2752090D02*
D03*
X2498090Y17865089D02*
D03*
X2752090D02*
D03*
X2498090Y18119089D02*
D03*
X2752090D02*
D03*
X2498090Y18373090D02*
D03*
X2752090D02*
D03*
X2498090Y18627089D02*
D03*
X2752090D02*
D03*
X2498090Y18881088D02*
D03*
X2752090D02*
D03*
X2498090Y19135091D02*
D03*
X2752090D02*
D03*
X2498090Y19389090D02*
D03*
X2752090D02*
D03*
X2498090Y22183092D02*
D03*
X2752090D02*
D03*
X2498090Y22437093D02*
D03*
X2752090D02*
D03*
Y23199092D02*
D03*
Y22691092D02*
D03*
X2498090D02*
D03*
Y22945091D02*
D03*
X2752090D02*
D03*
X2498090Y23199092D02*
D03*
Y23453091D02*
D03*
X2752090D02*
D03*
X2498090Y23707092D02*
D03*
X2752090D02*
D03*
Y21929092D02*
D03*
X2498090D02*
D03*
X2752090Y21675092D02*
D03*
X2498090D02*
D03*
X2752090Y21421091D02*
D03*
X2498090D02*
D03*
Y21167091D02*
D03*
X2752090Y20913091D02*
D03*
X2498090D02*
D03*
Y20659091D02*
D03*
X2752090D02*
D03*
Y21167091D02*
D03*
Y20405090D02*
D03*
X2498090D02*
D03*
X2752090Y20151089D02*
D03*
X2498090D02*
D03*
Y19897090D02*
D03*
X2752090Y19643089D02*
D03*
X2498090D02*
D03*
X2752090Y19897090D02*
D03*
X24003000Y13182600D02*
D03*
Y12928600D02*
D03*
X24257001Y13182600D02*
D03*
Y12928600D02*
D03*
X24511000D02*
D03*
Y13182600D02*
D03*
X24764999Y12928600D02*
D03*
Y13182600D02*
D03*
X25019000Y12928600D02*
D03*
Y13182600D02*
D03*
X22733000D02*
D03*
Y12928600D02*
D03*
X22987000Y13182600D02*
D03*
Y12928600D02*
D03*
X23241000D02*
D03*
Y13182600D02*
D03*
X23495000Y12928600D02*
D03*
Y13182600D02*
D03*
X23749001Y12928600D02*
D03*
Y13182600D02*
D03*
X16637000Y13182600D02*
D03*
Y12928600D02*
D03*
X16891000Y13182600D02*
D03*
Y12928600D02*
D03*
X17145000D02*
D03*
Y13182600D02*
D03*
X17399001Y12928600D02*
D03*
Y13182600D02*
D03*
X17653000Y12928600D02*
D03*
Y13182600D02*
D03*
X15367000D02*
D03*
Y12928600D02*
D03*
X15621001Y13182600D02*
D03*
Y12928600D02*
D03*
X15875000D02*
D03*
Y13182600D02*
D03*
X16128999Y12928600D02*
D03*
Y13182600D02*
D03*
X16383000Y12928600D02*
D03*
Y13182600D02*
D03*
D25*
X39224689Y24601093D02*
D03*
Y14939087D02*
D03*
X35160690Y24601093D02*
D03*
Y14939087D02*
D03*
X31096689Y24601093D02*
D03*
Y14939087D02*
D03*
X27032690Y24601093D02*
D03*
Y14939087D02*
D03*
X22968689Y24601093D02*
D03*
Y14939087D02*
D03*
X18904689Y24601093D02*
D03*
Y14939087D02*
D03*
X14840689Y24601093D02*
D03*
Y14939087D02*
D03*
X10776689Y24601093D02*
D03*
Y14939087D02*
D03*
X6711927Y24601093D02*
D03*
Y14939087D02*
D03*
X2650490Y24601093D02*
D03*
Y14939087D02*
D03*
%TF.MD5,b9dd1a968c905a59848ea82669a07a53*%
M02*
