%TF.GenerationSoftware,Altium Limited,Altium Designer,19.1.5 (86)*%
G04 Layer_Color=32896*
%FSLAX45Y45*%
%MOMM*%
%TF.FileFunction,Other,Notvisible*%
%TF.Part,Single*%
G01*
G75*
%TA.AperFunction,NonConductor*%
%ADD27C,0.25400*%
%ADD49C,0.12000*%
%ADD50C,0.12700*%
%ADD54C,0.10000*%
%ADD55C,0.05000*%
D27*
X10072508Y-2175494D02*
X10834508Y-1413494D01*
X9564508Y-2175494D02*
X10326508Y-1413494D01*
X8231008Y-2175494D02*
X10263008D01*
X9056508D02*
X9818508Y-1413494D01*
X8548508Y-2175494D02*
X9310508Y-1413494D01*
D49*
X15978008Y4809506D02*
X15858047D01*
Y4869487D01*
X15878041Y4889480D01*
X15918028D01*
X15938020Y4869487D01*
Y4809506D01*
X15878041Y5009442D02*
X15858047Y4989448D01*
Y4949461D01*
X15878041Y4929467D01*
X15958015D01*
X15978008Y4949461D01*
Y4989448D01*
X15958015Y5009442D01*
X15858047Y5049429D02*
X15978008D01*
Y5109409D01*
X15958015Y5129403D01*
X15938020D01*
X15918028Y5109409D01*
Y5049429D01*
Y5109409D01*
X15898035Y5129403D01*
X15878041D01*
X15858047Y5109409D01*
Y5049429D01*
X15978008Y18144505D02*
X15858047D01*
Y18204488D01*
X15878041Y18224480D01*
X15918028D01*
X15938020Y18204488D01*
Y18144505D01*
X15878041Y18344443D02*
X15858047Y18324448D01*
Y18284460D01*
X15878041Y18264467D01*
X15958015D01*
X15978008Y18284460D01*
Y18324448D01*
X15958015Y18344443D01*
X15858047Y18384428D02*
X15978008D01*
Y18444409D01*
X15958015Y18464403D01*
X15938020D01*
X15918028Y18444409D01*
Y18384428D01*
Y18444409D01*
X15898035Y18464403D01*
X15878041D01*
X15858047Y18444409D01*
Y18384428D01*
D50*
X15849008Y555008D02*
G03*
X15849008Y555008I-125000J0D01*
G01*
Y555000D02*
G03*
X15849008Y555000I-125000J0D01*
G01*
Y9445005D02*
G03*
X15849008Y9445005I-125000J0D01*
G01*
Y13890009D02*
G03*
X15849008Y13890009I-125000J0D01*
G01*
Y22780013D02*
G03*
X15849008Y22780013I-125000J0D01*
G01*
X15875008Y13467506D02*
G03*
X15875008Y13467506I-25000J0D01*
G01*
Y13267506D02*
G03*
X15875008Y13267506I-25000J0D01*
G01*
Y13067506D02*
G03*
X15875008Y13067506I-25000J0D01*
G01*
Y12867506D02*
G03*
X15875008Y12867506I-25000J0D01*
G01*
Y12667507D02*
G03*
X15875008Y12667507I-25000J0D01*
G01*
Y12467507D02*
G03*
X15875008Y12467507I-25000J0D01*
G01*
Y12267507D02*
G03*
X15875008Y12267507I-25000J0D01*
G01*
Y12067506D02*
G03*
X15875008Y12067506I-25000J0D01*
G01*
Y11867506D02*
G03*
X15875008Y11867506I-25000J0D01*
G01*
Y11667506D02*
G03*
X15875008Y11667506I-25000J0D01*
G01*
Y11467506D02*
G03*
X15875008Y11467506I-25000J0D01*
G01*
Y11267506D02*
G03*
X15875008Y11267506I-25000J0D01*
G01*
Y11067506D02*
G03*
X15875008Y11067506I-25000J0D01*
G01*
Y10867506D02*
G03*
X15875008Y10867506I-25000J0D01*
G01*
Y10667506D02*
G03*
X15875008Y10667506I-25000J0D01*
G01*
Y10467506D02*
G03*
X15875008Y10467506I-25000J0D01*
G01*
Y10267505D02*
G03*
X15875008Y10267505I-25000J0D01*
G01*
Y10067505D02*
G03*
X15875008Y10067505I-25000J0D01*
G01*
Y9867505D02*
G03*
X15875008Y9867505I-25000J0D01*
G01*
X15675008Y13467506D02*
G03*
X15675008Y13467506I-25000J0D01*
G01*
Y13267506D02*
G03*
X15675008Y13267506I-25000J0D01*
G01*
Y13067506D02*
G03*
X15675008Y13067506I-25000J0D01*
G01*
Y12867506D02*
G03*
X15675008Y12867506I-25000J0D01*
G01*
Y12667507D02*
G03*
X15675008Y12667507I-25000J0D01*
G01*
Y12467507D02*
G03*
X15675008Y12467507I-25000J0D01*
G01*
Y12267507D02*
G03*
X15675008Y12267507I-25000J0D01*
G01*
Y12067506D02*
G03*
X15675008Y12067506I-25000J0D01*
G01*
Y11867506D02*
G03*
X15675008Y11867506I-25000J0D01*
G01*
Y11667506D02*
G03*
X15675008Y11667506I-25000J0D01*
G01*
Y11467506D02*
G03*
X15675008Y11467506I-25000J0D01*
G01*
Y11267506D02*
G03*
X15675008Y11267506I-25000J0D01*
G01*
Y11067506D02*
G03*
X15675008Y11067506I-25000J0D01*
G01*
Y10867506D02*
G03*
X15675008Y10867506I-25000J0D01*
G01*
Y10667506D02*
G03*
X15675008Y10667506I-25000J0D01*
G01*
Y10467506D02*
G03*
X15675008Y10467506I-25000J0D01*
G01*
Y10267505D02*
G03*
X15675008Y10267505I-25000J0D01*
G01*
Y10067505D02*
G03*
X15675008Y10067505I-25000J0D01*
G01*
Y9867505D02*
G03*
X15675008Y9867505I-25000J0D01*
G01*
X15475008Y13467506D02*
G03*
X15475008Y13467506I-25000J0D01*
G01*
Y13267506D02*
G03*
X15475008Y13267506I-25000J0D01*
G01*
Y13067506D02*
G03*
X15475008Y13067506I-25000J0D01*
G01*
Y12867506D02*
G03*
X15475008Y12867506I-25000J0D01*
G01*
Y12667507D02*
G03*
X15475008Y12667507I-25000J0D01*
G01*
Y12467507D02*
G03*
X15475008Y12467507I-25000J0D01*
G01*
Y12267507D02*
G03*
X15475008Y12267507I-25000J0D01*
G01*
Y12067506D02*
G03*
X15475008Y12067506I-25000J0D01*
G01*
Y11867506D02*
G03*
X15475008Y11867506I-25000J0D01*
G01*
Y11667506D02*
G03*
X15475008Y11667506I-25000J0D01*
G01*
Y11467506D02*
G03*
X15475008Y11467506I-25000J0D01*
G01*
Y11267506D02*
G03*
X15475008Y11267506I-25000J0D01*
G01*
Y11067506D02*
G03*
X15475008Y11067506I-25000J0D01*
G01*
Y10867506D02*
G03*
X15475008Y10867506I-25000J0D01*
G01*
Y10667506D02*
G03*
X15475008Y10667506I-25000J0D01*
G01*
Y10467506D02*
G03*
X15475008Y10467506I-25000J0D01*
G01*
Y10267505D02*
G03*
X15475008Y10267505I-25000J0D01*
G01*
Y10067505D02*
G03*
X15475008Y10067505I-25000J0D01*
G01*
Y9867505D02*
G03*
X15475008Y9867505I-25000J0D01*
G01*
X15275008Y13467506D02*
G03*
X15275008Y13467506I-25000J0D01*
G01*
Y13267506D02*
G03*
X15275008Y13267506I-25000J0D01*
G01*
Y13067506D02*
G03*
X15275008Y13067506I-25000J0D01*
G01*
Y12867506D02*
G03*
X15275008Y12867506I-25000J0D01*
G01*
Y12667507D02*
G03*
X15275008Y12667507I-25000J0D01*
G01*
Y12467507D02*
G03*
X15275008Y12467507I-25000J0D01*
G01*
Y12267507D02*
G03*
X15275008Y12267507I-25000J0D01*
G01*
Y12067506D02*
G03*
X15275008Y12067506I-25000J0D01*
G01*
Y11867506D02*
G03*
X15275008Y11867506I-25000J0D01*
G01*
Y11667506D02*
G03*
X15275008Y11667506I-25000J0D01*
G01*
Y11467506D02*
G03*
X15275008Y11467506I-25000J0D01*
G01*
Y11267506D02*
G03*
X15275008Y11267506I-25000J0D01*
G01*
Y11067506D02*
G03*
X15275008Y11067506I-25000J0D01*
G01*
Y10867506D02*
G03*
X15275008Y10867506I-25000J0D01*
G01*
Y10667506D02*
G03*
X15275008Y10667506I-25000J0D01*
G01*
Y10467506D02*
G03*
X15275008Y10467506I-25000J0D01*
G01*
Y10267505D02*
G03*
X15275008Y10267505I-25000J0D01*
G01*
Y10067505D02*
G03*
X15275008Y10067505I-25000J0D01*
G01*
Y9867505D02*
G03*
X15275008Y9867505I-25000J0D01*
G01*
X15075008Y13467506D02*
G03*
X15075008Y13467506I-25000J0D01*
G01*
Y13267506D02*
G03*
X15075008Y13267506I-25000J0D01*
G01*
Y13067506D02*
G03*
X15075008Y13067506I-25000J0D01*
G01*
Y12867506D02*
G03*
X15075008Y12867506I-25000J0D01*
G01*
Y12667507D02*
G03*
X15075008Y12667507I-25000J0D01*
G01*
Y12467507D02*
G03*
X15075008Y12467507I-25000J0D01*
G01*
Y12267507D02*
G03*
X15075008Y12267507I-25000J0D01*
G01*
Y12067506D02*
G03*
X15075008Y12067506I-25000J0D01*
G01*
Y11867506D02*
G03*
X15075008Y11867506I-25000J0D01*
G01*
Y11667506D02*
G03*
X15075008Y11667506I-25000J0D01*
G01*
Y11467506D02*
G03*
X15075008Y11467506I-25000J0D01*
G01*
Y11267506D02*
G03*
X15075008Y11267506I-25000J0D01*
G01*
Y11067506D02*
G03*
X15075008Y11067506I-25000J0D01*
G01*
Y10867506D02*
G03*
X15075008Y10867506I-25000J0D01*
G01*
Y10667506D02*
G03*
X15075008Y10667506I-25000J0D01*
G01*
Y10467506D02*
G03*
X15075008Y10467506I-25000J0D01*
G01*
Y10267505D02*
G03*
X15075008Y10267505I-25000J0D01*
G01*
Y10067505D02*
G03*
X15075008Y10067505I-25000J0D01*
G01*
Y9867505D02*
G03*
X15075008Y9867505I-25000J0D01*
G01*
X14875008Y13467506D02*
G03*
X14875008Y13467506I-25000J0D01*
G01*
Y13267506D02*
G03*
X14875008Y13267506I-25000J0D01*
G01*
Y13067506D02*
G03*
X14875008Y13067506I-25000J0D01*
G01*
Y12867506D02*
G03*
X14875008Y12867506I-25000J0D01*
G01*
Y12667507D02*
G03*
X14875008Y12667507I-25000J0D01*
G01*
Y12467507D02*
G03*
X14875008Y12467507I-25000J0D01*
G01*
Y12267507D02*
G03*
X14875008Y12267507I-25000J0D01*
G01*
Y12067506D02*
G03*
X14875008Y12067506I-25000J0D01*
G01*
Y11867506D02*
G03*
X14875008Y11867506I-25000J0D01*
G01*
Y11667506D02*
G03*
X14875008Y11667506I-25000J0D01*
G01*
Y11467506D02*
G03*
X14875008Y11467506I-25000J0D01*
G01*
Y11267506D02*
G03*
X14875008Y11267506I-25000J0D01*
G01*
Y11067506D02*
G03*
X14875008Y11067506I-25000J0D01*
G01*
Y10867506D02*
G03*
X14875008Y10867506I-25000J0D01*
G01*
Y10667506D02*
G03*
X14875008Y10667506I-25000J0D01*
G01*
Y10467506D02*
G03*
X14875008Y10467506I-25000J0D01*
G01*
Y10267505D02*
G03*
X14875008Y10267505I-25000J0D01*
G01*
Y10067505D02*
G03*
X14875008Y10067505I-25000J0D01*
G01*
Y9867505D02*
G03*
X14875008Y9867505I-25000J0D01*
G01*
X15749008Y1063000D02*
G03*
X15749008Y1063000I-25000J0D01*
G01*
X15495007D02*
G03*
X15495007Y1063000I-25000J0D01*
G01*
X15241008D02*
G03*
X15241008Y1063000I-25000J0D01*
G01*
X14987009D02*
G03*
X14987009Y1063000I-25000J0D01*
G01*
X14733008D02*
G03*
X14733008Y1063000I-25000J0D01*
G01*
X15749008Y1317001D02*
G03*
X15749008Y1317001I-25000J0D01*
G01*
X15495007D02*
G03*
X15495007Y1317001I-25000J0D01*
G01*
X15241008D02*
G03*
X15241008Y1317001I-25000J0D01*
G01*
X14987009D02*
G03*
X14987009Y1317001I-25000J0D01*
G01*
X14733008D02*
G03*
X14733008Y1317001I-25000J0D01*
G01*
X15749008Y1571001D02*
G03*
X15749008Y1571001I-25000J0D01*
G01*
X15495007D02*
G03*
X15495007Y1571001I-25000J0D01*
G01*
X15241008D02*
G03*
X15241008Y1571001I-25000J0D01*
G01*
X14987009D02*
G03*
X14987009Y1571001I-25000J0D01*
G01*
X14733008D02*
G03*
X14733008Y1571001I-25000J0D01*
G01*
X15749008Y1825001D02*
G03*
X15749008Y1825001I-25000J0D01*
G01*
X15495007D02*
G03*
X15495007Y1825001I-25000J0D01*
G01*
X15241008D02*
G03*
X15241008Y1825001I-25000J0D01*
G01*
X14987009D02*
G03*
X14987009Y1825001I-25000J0D01*
G01*
X14733008D02*
G03*
X14733008Y1825001I-25000J0D01*
G01*
X15749008Y2079001D02*
G03*
X15749008Y2079001I-25000J0D01*
G01*
X15495007D02*
G03*
X15495007Y2079001I-25000J0D01*
G01*
X15241008D02*
G03*
X15241008Y2079001I-25000J0D01*
G01*
X14987009D02*
G03*
X14987009Y2079001I-25000J0D01*
G01*
X14733008D02*
G03*
X14733008Y2079001I-25000J0D01*
G01*
X15749008Y2333001D02*
G03*
X15749008Y2333001I-25000J0D01*
G01*
X15495007D02*
G03*
X15495007Y2333001I-25000J0D01*
G01*
X15241008D02*
G03*
X15241008Y2333001I-25000J0D01*
G01*
X14987009D02*
G03*
X14987009Y2333001I-25000J0D01*
G01*
X14733008D02*
G03*
X14733008Y2333001I-25000J0D01*
G01*
X15749008Y2587001D02*
G03*
X15749008Y2587001I-25000J0D01*
G01*
X15495007D02*
G03*
X15495007Y2587001I-25000J0D01*
G01*
X15241008D02*
G03*
X15241008Y2587001I-25000J0D01*
G01*
X14987009D02*
G03*
X14987009Y2587001I-25000J0D01*
G01*
X14733008D02*
G03*
X14733008Y2587001I-25000J0D01*
G01*
X15749008Y2841001D02*
G03*
X15749008Y2841001I-25000J0D01*
G01*
X15495007D02*
G03*
X15495007Y2841001I-25000J0D01*
G01*
X15241008D02*
G03*
X15241008Y2841001I-25000J0D01*
G01*
X14987009D02*
G03*
X14987009Y2841001I-25000J0D01*
G01*
X14733008D02*
G03*
X14733008Y2841001I-25000J0D01*
G01*
X15749008Y3095002D02*
G03*
X15749008Y3095002I-25000J0D01*
G01*
X15495007D02*
G03*
X15495007Y3095002I-25000J0D01*
G01*
X15241008D02*
G03*
X15241008Y3095002I-25000J0D01*
G01*
X14987009D02*
G03*
X14987009Y3095002I-25000J0D01*
G01*
X14733008D02*
G03*
X14733008Y3095002I-25000J0D01*
G01*
X15749008Y3349002D02*
G03*
X15749008Y3349002I-25000J0D01*
G01*
X15495007D02*
G03*
X15495007Y3349002I-25000J0D01*
G01*
X15241008D02*
G03*
X15241008Y3349002I-25000J0D01*
G01*
X14987009D02*
G03*
X14987009Y3349002I-25000J0D01*
G01*
X14733008D02*
G03*
X14733008Y3349002I-25000J0D01*
G01*
X15749008Y3603002D02*
G03*
X15749008Y3603002I-25000J0D01*
G01*
X15495007D02*
G03*
X15495007Y3603002I-25000J0D01*
G01*
X15241008D02*
G03*
X15241008Y3603002I-25000J0D01*
G01*
X14987009D02*
G03*
X14987009Y3603002I-25000J0D01*
G01*
X14733008D02*
G03*
X14733008Y3603002I-25000J0D01*
G01*
X15749008Y3857002D02*
G03*
X15749008Y3857002I-25000J0D01*
G01*
X15495007D02*
G03*
X15495007Y3857002I-25000J0D01*
G01*
X15241008D02*
G03*
X15241008Y3857002I-25000J0D01*
G01*
X14987009D02*
G03*
X14987009Y3857002I-25000J0D01*
G01*
X14733008D02*
G03*
X14733008Y3857002I-25000J0D01*
G01*
X15749008Y4111002D02*
G03*
X15749008Y4111002I-25000J0D01*
G01*
X15495007D02*
G03*
X15495007Y4111002I-25000J0D01*
G01*
X15241008D02*
G03*
X15241008Y4111002I-25000J0D01*
G01*
X14987009D02*
G03*
X14987009Y4111002I-25000J0D01*
G01*
X14733008D02*
G03*
X14733008Y4111002I-25000J0D01*
G01*
X15749008Y4365002D02*
G03*
X15749008Y4365002I-25000J0D01*
G01*
X15495007D02*
G03*
X15495007Y4365002I-25000J0D01*
G01*
X15241008D02*
G03*
X15241008Y4365002I-25000J0D01*
G01*
X14987009D02*
G03*
X14987009Y4365002I-25000J0D01*
G01*
X14733008D02*
G03*
X14733008Y4365002I-25000J0D01*
G01*
X15749008Y4619002D02*
G03*
X15749008Y4619002I-25000J0D01*
G01*
X15495007D02*
G03*
X15495007Y4619002I-25000J0D01*
G01*
X15241008D02*
G03*
X15241008Y4619002I-25000J0D01*
G01*
X14987009D02*
G03*
X14987009Y4619002I-25000J0D01*
G01*
X14733008D02*
G03*
X14733008Y4619002I-25000J0D01*
G01*
X15749008Y4873003D02*
G03*
X15749008Y4873003I-25000J0D01*
G01*
X15495007D02*
G03*
X15495007Y4873003I-25000J0D01*
G01*
X15241008D02*
G03*
X15241008Y4873003I-25000J0D01*
G01*
X14987009D02*
G03*
X14987009Y4873003I-25000J0D01*
G01*
X14733008D02*
G03*
X14733008Y4873003I-25000J0D01*
G01*
X15749008Y5127003D02*
G03*
X15749008Y5127003I-25000J0D01*
G01*
X15495007D02*
G03*
X15495007Y5127003I-25000J0D01*
G01*
X15241008D02*
G03*
X15241008Y5127003I-25000J0D01*
G01*
X14987009D02*
G03*
X14987009Y5127003I-25000J0D01*
G01*
X14733008D02*
G03*
X14733008Y5127003I-25000J0D01*
G01*
X15749008Y5381003D02*
G03*
X15749008Y5381003I-25000J0D01*
G01*
X15495007D02*
G03*
X15495007Y5381003I-25000J0D01*
G01*
X15241008D02*
G03*
X15241008Y5381003I-25000J0D01*
G01*
X14987009D02*
G03*
X14987009Y5381003I-25000J0D01*
G01*
X14733008D02*
G03*
X14733008Y5381003I-25000J0D01*
G01*
X15749008Y5635003D02*
G03*
X15749008Y5635003I-25000J0D01*
G01*
X15495007D02*
G03*
X15495007Y5635003I-25000J0D01*
G01*
X15241008D02*
G03*
X15241008Y5635003I-25000J0D01*
G01*
X14987009D02*
G03*
X14987009Y5635003I-25000J0D01*
G01*
X14733008D02*
G03*
X14733008Y5635003I-25000J0D01*
G01*
X15749008Y5889003D02*
G03*
X15749008Y5889003I-25000J0D01*
G01*
X15495007D02*
G03*
X15495007Y5889003I-25000J0D01*
G01*
X15241008D02*
G03*
X15241008Y5889003I-25000J0D01*
G01*
X14987009D02*
G03*
X14987009Y5889003I-25000J0D01*
G01*
X14733008D02*
G03*
X14733008Y5889003I-25000J0D01*
G01*
X15749008Y6143003D02*
G03*
X15749008Y6143003I-25000J0D01*
G01*
X15495007D02*
G03*
X15495007Y6143003I-25000J0D01*
G01*
X15241008D02*
G03*
X15241008Y6143003I-25000J0D01*
G01*
X14987009D02*
G03*
X14987009Y6143003I-25000J0D01*
G01*
X14733008D02*
G03*
X14733008Y6143003I-25000J0D01*
G01*
X15749008Y6397003D02*
G03*
X15749008Y6397003I-25000J0D01*
G01*
X15495007D02*
G03*
X15495007Y6397003I-25000J0D01*
G01*
X15241008D02*
G03*
X15241008Y6397003I-25000J0D01*
G01*
X14987009D02*
G03*
X14987009Y6397003I-25000J0D01*
G01*
X14733008D02*
G03*
X14733008Y6397003I-25000J0D01*
G01*
X15749008Y6651003D02*
G03*
X15749008Y6651003I-25000J0D01*
G01*
X15495007D02*
G03*
X15495007Y6651003I-25000J0D01*
G01*
X15241008D02*
G03*
X15241008Y6651003I-25000J0D01*
G01*
X14987009D02*
G03*
X14987009Y6651003I-25000J0D01*
G01*
X14733008D02*
G03*
X14733008Y6651003I-25000J0D01*
G01*
X15749008Y6905004D02*
G03*
X15749008Y6905004I-25000J0D01*
G01*
X15495007D02*
G03*
X15495007Y6905004I-25000J0D01*
G01*
X15241008D02*
G03*
X15241008Y6905004I-25000J0D01*
G01*
X14987009D02*
G03*
X14987009Y6905004I-25000J0D01*
G01*
X14733008D02*
G03*
X14733008Y6905004I-25000J0D01*
G01*
X15749008Y7159004D02*
G03*
X15749008Y7159004I-25000J0D01*
G01*
X15495007D02*
G03*
X15495007Y7159004I-25000J0D01*
G01*
X15241008D02*
G03*
X15241008Y7159004I-25000J0D01*
G01*
X14987009D02*
G03*
X14987009Y7159004I-25000J0D01*
G01*
X14733008D02*
G03*
X14733008Y7159004I-25000J0D01*
G01*
X15749008Y7413004D02*
G03*
X15749008Y7413004I-25000J0D01*
G01*
X15495007D02*
G03*
X15495007Y7413004I-25000J0D01*
G01*
X15241008D02*
G03*
X15241008Y7413004I-25000J0D01*
G01*
X14987009D02*
G03*
X14987009Y7413004I-25000J0D01*
G01*
X14733008D02*
G03*
X14733008Y7413004I-25000J0D01*
G01*
X15749008Y7667004D02*
G03*
X15749008Y7667004I-25000J0D01*
G01*
X15495007D02*
G03*
X15495007Y7667004I-25000J0D01*
G01*
X15241008D02*
G03*
X15241008Y7667004I-25000J0D01*
G01*
X14987009D02*
G03*
X14987009Y7667004I-25000J0D01*
G01*
X14733008D02*
G03*
X14733008Y7667004I-25000J0D01*
G01*
X15749008Y7921004D02*
G03*
X15749008Y7921004I-25000J0D01*
G01*
X15495007D02*
G03*
X15495007Y7921004I-25000J0D01*
G01*
X15241008D02*
G03*
X15241008Y7921004I-25000J0D01*
G01*
X14987009D02*
G03*
X14987009Y7921004I-25000J0D01*
G01*
X14733008D02*
G03*
X14733008Y7921004I-25000J0D01*
G01*
X15749008Y8175004D02*
G03*
X15749008Y8175004I-25000J0D01*
G01*
X15495007D02*
G03*
X15495007Y8175004I-25000J0D01*
G01*
X15241008D02*
G03*
X15241008Y8175004I-25000J0D01*
G01*
X14987009D02*
G03*
X14987009Y8175004I-25000J0D01*
G01*
X14733008D02*
G03*
X14733008Y8175004I-25000J0D01*
G01*
X15749008Y8429004D02*
G03*
X15749008Y8429004I-25000J0D01*
G01*
X15495007D02*
G03*
X15495007Y8429004I-25000J0D01*
G01*
X15241008D02*
G03*
X15241008Y8429004I-25000J0D01*
G01*
X14987009D02*
G03*
X14987009Y8429004I-25000J0D01*
G01*
X14733008D02*
G03*
X14733008Y8429004I-25000J0D01*
G01*
X15749008Y8683005D02*
G03*
X15749008Y8683005I-25000J0D01*
G01*
X15495007D02*
G03*
X15495007Y8683005I-25000J0D01*
G01*
X15241008D02*
G03*
X15241008Y8683005I-25000J0D01*
G01*
X14987009D02*
G03*
X14987009Y8683005I-25000J0D01*
G01*
X14733008D02*
G03*
X14733008Y8683005I-25000J0D01*
G01*
X15749008Y8937005D02*
G03*
X15749008Y8937005I-25000J0D01*
G01*
X15495007D02*
G03*
X15495007Y8937005I-25000J0D01*
G01*
X15241008D02*
G03*
X15241008Y8937005I-25000J0D01*
G01*
X14987009D02*
G03*
X14987009Y8937005I-25000J0D01*
G01*
X14733008D02*
G03*
X14733008Y8937005I-25000J0D01*
G01*
X15749008Y14398009D02*
G03*
X15749008Y14398009I-25000J0D01*
G01*
X15495007D02*
G03*
X15495007Y14398009I-25000J0D01*
G01*
X15241008D02*
G03*
X15241008Y14398009I-25000J0D01*
G01*
X14987009D02*
G03*
X14987009Y14398009I-25000J0D01*
G01*
X14733008D02*
G03*
X14733008Y14398009I-25000J0D01*
G01*
X15749008Y14652008D02*
G03*
X15749008Y14652008I-25000J0D01*
G01*
X15495007D02*
G03*
X15495007Y14652008I-25000J0D01*
G01*
X15241008D02*
G03*
X15241008Y14652008I-25000J0D01*
G01*
X14987009D02*
G03*
X14987009Y14652008I-25000J0D01*
G01*
X14733008D02*
G03*
X14733008Y14652008I-25000J0D01*
G01*
X15749008Y14906007D02*
G03*
X15749008Y14906007I-25000J0D01*
G01*
X15495007D02*
G03*
X15495007Y14906007I-25000J0D01*
G01*
X15241008D02*
G03*
X15241008Y14906007I-25000J0D01*
G01*
X14987009D02*
G03*
X14987009Y14906007I-25000J0D01*
G01*
X14733008D02*
G03*
X14733008Y14906007I-25000J0D01*
G01*
X15749008Y15160008D02*
G03*
X15749008Y15160008I-25000J0D01*
G01*
X15495007D02*
G03*
X15495007Y15160008I-25000J0D01*
G01*
X15241008D02*
G03*
X15241008Y15160008I-25000J0D01*
G01*
X14987009D02*
G03*
X14987009Y15160008I-25000J0D01*
G01*
X14733008D02*
G03*
X14733008Y15160008I-25000J0D01*
G01*
X15749008Y15414008D02*
G03*
X15749008Y15414008I-25000J0D01*
G01*
X15495007D02*
G03*
X15495007Y15414008I-25000J0D01*
G01*
X15241008D02*
G03*
X15241008Y15414008I-25000J0D01*
G01*
X14987009D02*
G03*
X14987009Y15414008I-25000J0D01*
G01*
X14733008D02*
G03*
X14733008Y15414008I-25000J0D01*
G01*
X15749008Y15668008D02*
G03*
X15749008Y15668008I-25000J0D01*
G01*
X15495007D02*
G03*
X15495007Y15668008I-25000J0D01*
G01*
X15241008D02*
G03*
X15241008Y15668008I-25000J0D01*
G01*
X14987009D02*
G03*
X14987009Y15668008I-25000J0D01*
G01*
X14733008D02*
G03*
X14733008Y15668008I-25000J0D01*
G01*
X15749008Y15922009D02*
G03*
X15749008Y15922009I-25000J0D01*
G01*
X15495007D02*
G03*
X15495007Y15922009I-25000J0D01*
G01*
X15241008D02*
G03*
X15241008Y15922009I-25000J0D01*
G01*
X14987009D02*
G03*
X14987009Y15922009I-25000J0D01*
G01*
X14733008D02*
G03*
X14733008Y15922009I-25000J0D01*
G01*
X15749008Y16176009D02*
G03*
X15749008Y16176009I-25000J0D01*
G01*
X15495007D02*
G03*
X15495007Y16176009I-25000J0D01*
G01*
X15241008D02*
G03*
X15241008Y16176009I-25000J0D01*
G01*
X14987009D02*
G03*
X14987009Y16176009I-25000J0D01*
G01*
X14733008D02*
G03*
X14733008Y16176009I-25000J0D01*
G01*
X15749008Y16430009D02*
G03*
X15749008Y16430009I-25000J0D01*
G01*
X15495007D02*
G03*
X15495007Y16430009I-25000J0D01*
G01*
X15241008D02*
G03*
X15241008Y16430009I-25000J0D01*
G01*
X14987009D02*
G03*
X14987009Y16430009I-25000J0D01*
G01*
X14733008D02*
G03*
X14733008Y16430009I-25000J0D01*
G01*
X15749008Y16684009D02*
G03*
X15749008Y16684009I-25000J0D01*
G01*
X15495007D02*
G03*
X15495007Y16684009I-25000J0D01*
G01*
X15241008D02*
G03*
X15241008Y16684009I-25000J0D01*
G01*
X14987009D02*
G03*
X14987009Y16684009I-25000J0D01*
G01*
X14733008D02*
G03*
X14733008Y16684009I-25000J0D01*
G01*
X15749008Y16938010D02*
G03*
X15749008Y16938010I-25000J0D01*
G01*
X15495007D02*
G03*
X15495007Y16938010I-25000J0D01*
G01*
X15241008D02*
G03*
X15241008Y16938010I-25000J0D01*
G01*
X14987009D02*
G03*
X14987009Y16938010I-25000J0D01*
G01*
X14733008D02*
G03*
X14733008Y16938010I-25000J0D01*
G01*
X15749008Y17192009D02*
G03*
X15749008Y17192009I-25000J0D01*
G01*
X15495007D02*
G03*
X15495007Y17192009I-25000J0D01*
G01*
X15241008D02*
G03*
X15241008Y17192009I-25000J0D01*
G01*
X14987009D02*
G03*
X14987009Y17192009I-25000J0D01*
G01*
X14733008D02*
G03*
X14733008Y17192009I-25000J0D01*
G01*
X15749008Y17446008D02*
G03*
X15749008Y17446008I-25000J0D01*
G01*
X15495007D02*
G03*
X15495007Y17446008I-25000J0D01*
G01*
X15241008D02*
G03*
X15241008Y17446008I-25000J0D01*
G01*
X14987009D02*
G03*
X14987009Y17446008I-25000J0D01*
G01*
X14733008D02*
G03*
X14733008Y17446008I-25000J0D01*
G01*
X15749008Y17700011D02*
G03*
X15749008Y17700011I-25000J0D01*
G01*
X15495007D02*
G03*
X15495007Y17700011I-25000J0D01*
G01*
X15241008D02*
G03*
X15241008Y17700011I-25000J0D01*
G01*
X14987009D02*
G03*
X14987009Y17700011I-25000J0D01*
G01*
X14733008D02*
G03*
X14733008Y17700011I-25000J0D01*
G01*
X15749008Y17954010D02*
G03*
X15749008Y17954010I-25000J0D01*
G01*
X15495007D02*
G03*
X15495007Y17954010I-25000J0D01*
G01*
X15241008D02*
G03*
X15241008Y17954010I-25000J0D01*
G01*
X14987009D02*
G03*
X14987009Y17954010I-25000J0D01*
G01*
X14733008D02*
G03*
X14733008Y17954010I-25000J0D01*
G01*
X15749008Y18208009D02*
G03*
X15749008Y18208009I-25000J0D01*
G01*
X15495007D02*
G03*
X15495007Y18208009I-25000J0D01*
G01*
X15241008D02*
G03*
X15241008Y18208009I-25000J0D01*
G01*
X14987009D02*
G03*
X14987009Y18208009I-25000J0D01*
G01*
X14733008D02*
G03*
X14733008Y18208009I-25000J0D01*
G01*
X15749008Y18462010D02*
G03*
X15749008Y18462010I-25000J0D01*
G01*
X15495007D02*
G03*
X15495007Y18462010I-25000J0D01*
G01*
X15241008D02*
G03*
X15241008Y18462010I-25000J0D01*
G01*
X14987009D02*
G03*
X14987009Y18462010I-25000J0D01*
G01*
X14733008D02*
G03*
X14733008Y18462010I-25000J0D01*
G01*
X15749008Y18716010D02*
G03*
X15749008Y18716010I-25000J0D01*
G01*
X15495007D02*
G03*
X15495007Y18716010I-25000J0D01*
G01*
X15241008D02*
G03*
X15241008Y18716010I-25000J0D01*
G01*
X14987009D02*
G03*
X14987009Y18716010I-25000J0D01*
G01*
X14733008D02*
G03*
X14733008Y18716010I-25000J0D01*
G01*
X15749008Y18970010D02*
G03*
X15749008Y18970010I-25000J0D01*
G01*
X15495007D02*
G03*
X15495007Y18970010I-25000J0D01*
G01*
X15241008D02*
G03*
X15241008Y18970010I-25000J0D01*
G01*
X14987009D02*
G03*
X14987009Y18970010I-25000J0D01*
G01*
X14733008D02*
G03*
X14733008Y18970010I-25000J0D01*
G01*
X15749008Y19224010D02*
G03*
X15749008Y19224010I-25000J0D01*
G01*
X15495007D02*
G03*
X15495007Y19224010I-25000J0D01*
G01*
X15241008D02*
G03*
X15241008Y19224010I-25000J0D01*
G01*
X14987009D02*
G03*
X14987009Y19224010I-25000J0D01*
G01*
X14733008D02*
G03*
X14733008Y19224010I-25000J0D01*
G01*
X15749008Y19478011D02*
G03*
X15749008Y19478011I-25000J0D01*
G01*
X15495007D02*
G03*
X15495007Y19478011I-25000J0D01*
G01*
X15241008D02*
G03*
X15241008Y19478011I-25000J0D01*
G01*
X14987009D02*
G03*
X14987009Y19478011I-25000J0D01*
G01*
X14733008D02*
G03*
X14733008Y19478011I-25000J0D01*
G01*
X15749008Y19732011D02*
G03*
X15749008Y19732011I-25000J0D01*
G01*
X15495007D02*
G03*
X15495007Y19732011I-25000J0D01*
G01*
X15241008D02*
G03*
X15241008Y19732011I-25000J0D01*
G01*
X14987009D02*
G03*
X14987009Y19732011I-25000J0D01*
G01*
X14733008D02*
G03*
X14733008Y19732011I-25000J0D01*
G01*
X15749008Y19986011D02*
G03*
X15749008Y19986011I-25000J0D01*
G01*
X15495007D02*
G03*
X15495007Y19986011I-25000J0D01*
G01*
X15241008D02*
G03*
X15241008Y19986011I-25000J0D01*
G01*
X14987009D02*
G03*
X14987009Y19986011I-25000J0D01*
G01*
X14733008D02*
G03*
X14733008Y19986011I-25000J0D01*
G01*
X15749008Y20240012D02*
G03*
X15749008Y20240012I-25000J0D01*
G01*
X15495007D02*
G03*
X15495007Y20240012I-25000J0D01*
G01*
X15241008D02*
G03*
X15241008Y20240012I-25000J0D01*
G01*
X14987009D02*
G03*
X14987009Y20240012I-25000J0D01*
G01*
X14733008D02*
G03*
X14733008Y20240012I-25000J0D01*
G01*
X15749008Y20494011D02*
G03*
X15749008Y20494011I-25000J0D01*
G01*
X15495007D02*
G03*
X15495007Y20494011I-25000J0D01*
G01*
X15241008D02*
G03*
X15241008Y20494011I-25000J0D01*
G01*
X14987009D02*
G03*
X14987009Y20494011I-25000J0D01*
G01*
X14733008D02*
G03*
X14733008Y20494011I-25000J0D01*
G01*
X15749008Y20748010D02*
G03*
X15749008Y20748010I-25000J0D01*
G01*
X15495007D02*
G03*
X15495007Y20748010I-25000J0D01*
G01*
X15241008D02*
G03*
X15241008Y20748010I-25000J0D01*
G01*
X14987009D02*
G03*
X14987009Y20748010I-25000J0D01*
G01*
X14733008D02*
G03*
X14733008Y20748010I-25000J0D01*
G01*
X15749008Y21002011D02*
G03*
X15749008Y21002011I-25000J0D01*
G01*
X15495007D02*
G03*
X15495007Y21002011I-25000J0D01*
G01*
X15241008D02*
G03*
X15241008Y21002011I-25000J0D01*
G01*
X14987009D02*
G03*
X14987009Y21002011I-25000J0D01*
G01*
X14733008D02*
G03*
X14733008Y21002011I-25000J0D01*
G01*
X15749008Y21256010D02*
G03*
X15749008Y21256010I-25000J0D01*
G01*
X15495007D02*
G03*
X15495007Y21256010I-25000J0D01*
G01*
X15241008D02*
G03*
X15241008Y21256010I-25000J0D01*
G01*
X14987009D02*
G03*
X14987009Y21256010I-25000J0D01*
G01*
X14733008D02*
G03*
X14733008Y21256010I-25000J0D01*
G01*
X15749008Y21510011D02*
G03*
X15749008Y21510011I-25000J0D01*
G01*
X15495007D02*
G03*
X15495007Y21510011I-25000J0D01*
G01*
X15241008D02*
G03*
X15241008Y21510011I-25000J0D01*
G01*
X14987009D02*
G03*
X14987009Y21510011I-25000J0D01*
G01*
X14733008D02*
G03*
X14733008Y21510011I-25000J0D01*
G01*
X15749008Y21764012D02*
G03*
X15749008Y21764012I-25000J0D01*
G01*
X15495007D02*
G03*
X15495007Y21764012I-25000J0D01*
G01*
X15241008D02*
G03*
X15241008Y21764012I-25000J0D01*
G01*
X14987009D02*
G03*
X14987009Y21764012I-25000J0D01*
G01*
X14733008D02*
G03*
X14733008Y21764012I-25000J0D01*
G01*
X15749008Y22018011D02*
G03*
X15749008Y22018011I-25000J0D01*
G01*
X15495007D02*
G03*
X15495007Y22018011I-25000J0D01*
G01*
X15241008D02*
G03*
X15241008Y22018011I-25000J0D01*
G01*
X14987009D02*
G03*
X14987009Y22018011I-25000J0D01*
G01*
X14733008D02*
G03*
X14733008Y22018011I-25000J0D01*
G01*
X15749008Y22272012D02*
G03*
X15749008Y22272012I-25000J0D01*
G01*
X15495007D02*
G03*
X15495007Y22272012I-25000J0D01*
G01*
X15241008D02*
G03*
X15241008Y22272012I-25000J0D01*
G01*
X14987009D02*
G03*
X14987009Y22272012I-25000J0D01*
G01*
X14733008D02*
G03*
X14733008Y22272012I-25000J0D01*
G01*
X15851009Y11667506D02*
G03*
X15851009Y11667506I-127000J0D01*
G01*
X8050004D02*
G03*
X8050004Y11667506I-50000J0D01*
G01*
X50000Y0D02*
G03*
X50000Y0I-50000J0D01*
G01*
X492000Y22780013D02*
G03*
X492000Y22780013I-135000J0D01*
G01*
Y555000D02*
G03*
X492000Y555000I-135000J0D01*
G01*
X14962009Y14398009D02*
Y22272012D01*
X15724008Y555000D02*
X15849008D01*
X15724008Y430000D02*
Y555000D01*
Y9445005D02*
X15849008D01*
X15724008Y9320005D02*
Y9445005D01*
Y13890009D02*
X15849008D01*
X15724008Y13765009D02*
Y13890009D01*
Y22780013D02*
X15849008D01*
X15724008Y22655013D02*
Y22780013D01*
X14850008Y11667506D02*
X16000009D01*
X14850008Y13467506D02*
X15850008D01*
X14850008Y9867505D02*
X15850008D01*
Y13467506D01*
X14850008Y9867505D02*
Y13467506D01*
X15724008Y1063000D02*
Y8937005D01*
X14708008Y1063000D02*
Y8937005D01*
X15724008D01*
X14708008Y1063000D02*
X15724008D01*
X14708008Y22272012D02*
X15724008D01*
X14708008Y14398009D02*
X15724008D01*
Y22272012D01*
X14708008Y14398009D02*
Y22272012D01*
X15724008Y11667506D02*
X15813811Y11757309D01*
X15634206D02*
X15724008Y11667506D01*
X15813811Y11577704D01*
X15634206D02*
X15724008Y11667506D01*
X8000004Y0D02*
Y11667506D01*
X0D02*
X8000004D01*
X0Y0D02*
X8000004Y11667506D01*
X0Y23335013D02*
X8000004Y11667506D01*
X15950008Y100000D02*
Y250000D01*
X7000004Y100000D02*
Y250000D01*
X15950008D01*
X7000004Y100000D02*
X15950008D01*
X0Y23085013D02*
X16000009D01*
X7000004Y23235011D02*
X15950008D01*
Y23085013D02*
Y23235011D01*
X7000004Y23085013D02*
Y23235011D01*
Y23085013D02*
X15950008D01*
X0Y250000D02*
X16000009D01*
X257000Y555000D02*
X357000D01*
Y455000D02*
Y555000D01*
X257000Y22780013D02*
X357000D01*
Y22680013D02*
Y22780013D01*
X8000004Y11667506D02*
X16000009D01*
X8000004D02*
Y23335013D01*
Y11667506D02*
X16000009Y0D01*
X14854932Y13615414D02*
X14845409D01*
X14835889Y13610654D01*
X14831126Y13596371D01*
Y13515436D01*
X14816844Y13582089D02*
X14850169D01*
X15013397Y13572148D02*
X15070528D01*
Y13581670D01*
X15065767Y13591191D01*
X15061006Y13595952D01*
X15051485Y13600713D01*
X15037202D01*
X15027679Y13595952D01*
X15018158Y13586430D01*
X15013397Y13572148D01*
Y13562627D01*
X15018158Y13548343D01*
X15027679Y13538821D01*
X15037202Y13534061D01*
X15051485D01*
X15061006Y13538821D01*
X15070528Y13548343D01*
X15273952Y13619298D02*
Y13519319D01*
Y13571689D02*
X15264429Y13581210D01*
X15254907Y13585973D01*
X15240625D01*
X15231104Y13581210D01*
X15221581Y13571689D01*
X15216820Y13557407D01*
Y13547885D01*
X15221581Y13533601D01*
X15231104Y13524080D01*
X15240625Y13519319D01*
X15254907D01*
X15264429Y13524080D01*
X15273952Y13533601D01*
X15478951Y13584877D02*
X15469429Y13594398D01*
X15459908Y13599159D01*
X15445625D01*
X15436102Y13594398D01*
X15426581Y13584877D01*
X15421820Y13570593D01*
Y13561073D01*
X15426581Y13546790D01*
X15436102Y13537268D01*
X15445625Y13532507D01*
X15459908D01*
X15469429Y13537268D01*
X15478951Y13546790D01*
X15613196Y13619298D02*
Y13519319D01*
Y13571689D02*
X15622717Y13581210D01*
X15632240Y13585973D01*
X15646523D01*
X15656044Y13581210D01*
X15665565Y13571689D01*
X15670328Y13557407D01*
Y13547885D01*
X15665565Y13533601D01*
X15656044Y13524080D01*
X15646523Y13519319D01*
X15632240D01*
X15622717Y13524080D01*
X15613196Y13533601D01*
X15870328Y13597346D02*
Y13530695D01*
Y13583064D02*
X15860805Y13592586D01*
X15851283Y13597346D01*
X15837001D01*
X15827480Y13592586D01*
X15817957Y13583064D01*
X15813196Y13568782D01*
Y13559261D01*
X15817957Y13544978D01*
X15827480Y13535455D01*
X15837001Y13530695D01*
X15851283D01*
X15860805Y13535455D01*
X15870328Y13544978D01*
X14731950Y9115796D02*
Y9015817D01*
Y9068187D02*
X14722429Y9077709D01*
X14712907Y9082470D01*
X14698624D01*
X14689104Y9077709D01*
X14679581Y9068187D01*
X14674820Y9053904D01*
Y9044382D01*
X14679581Y9030100D01*
X14689104Y9020578D01*
X14698624Y9015817D01*
X14712907D01*
X14722429Y9020578D01*
X14731950Y9030100D01*
X14990952Y9081375D02*
X14981429Y9090896D01*
X14971907Y9095657D01*
X14957625D01*
X14948103Y9090896D01*
X14938580Y9081375D01*
X14933820Y9067092D01*
Y9057570D01*
X14938580Y9043287D01*
X14948103Y9033766D01*
X14957625Y9029005D01*
X14971907D01*
X14981429Y9033766D01*
X14990952Y9043287D01*
X15179196Y9115796D02*
Y9015817D01*
Y9068187D02*
X15188718Y9077709D01*
X15198241Y9082470D01*
X15212521D01*
X15222044Y9077709D01*
X15231566Y9068187D01*
X15236327Y9053904D01*
Y9044382D01*
X15231566Y9030100D01*
X15222044Y9020578D01*
X15212521Y9015817D01*
X15198241D01*
X15188718Y9020578D01*
X15179196Y9030100D01*
X15490327Y9093845D02*
Y9027193D01*
Y9079562D02*
X15480804Y9089084D01*
X15471283Y9093845D01*
X15457001D01*
X15447479Y9089084D01*
X15437956Y9079562D01*
X15433195Y9065280D01*
Y9055758D01*
X15437956Y9041475D01*
X15447479Y9031954D01*
X15457001Y9027193D01*
X15471283D01*
X15480804Y9031954D01*
X15490327Y9041475D01*
X15741377Y9095657D02*
X15689008Y9029005D01*
Y9095657D02*
X15741377D01*
X15689008Y9029005D02*
X15741377D01*
X14199928Y11662724D02*
X14285625D01*
X14314191Y11672246D01*
X14323712Y11681768D01*
X14333234Y11700811D01*
Y11729376D01*
X14323712Y11748420D01*
X14314191Y11757942D01*
X14285625Y11767463D01*
X14199928D01*
Y11567506D01*
X14435117Y11767463D02*
X14406552Y11757942D01*
X14387508Y11729376D01*
X14377986Y11681768D01*
Y11653202D01*
X14387508Y11605593D01*
X14406552Y11577028D01*
X14435117Y11567506D01*
X14454160D01*
X14482726Y11577028D01*
X14501768Y11605593D01*
X14511292Y11653202D01*
Y11681768D01*
X14501768Y11729376D01*
X14482726Y11757942D01*
X14454160Y11767463D01*
X14435117D01*
X14052002Y4990201D02*
X14137698D01*
X14166263Y4999722D01*
X14175784Y5009244D01*
X14185306Y5028288D01*
Y5056853D01*
X14175784Y5075897D01*
X14166263Y5085418D01*
X14137698Y5094940D01*
X14052002D01*
Y4894983D01*
X14239581Y5047331D02*
Y5056853D01*
X14249103Y5075897D01*
X14258624Y5085418D01*
X14277669Y5094940D01*
X14315755D01*
X14334798Y5085418D01*
X14344321Y5075897D01*
X14353842Y5056853D01*
Y5037810D01*
X14344321Y5018766D01*
X14325278Y4990201D01*
X14230058Y4894983D01*
X14363364D01*
X14390526Y1112541D02*
X14442896D01*
X14414331Y1074453D01*
X14428613D01*
X14438135Y1069693D01*
X14442896Y1064932D01*
X14447656Y1050649D01*
Y1041127D01*
X14442896Y1026845D01*
X14433374Y1017323D01*
X14419092Y1012562D01*
X14404810D01*
X14390526Y1017323D01*
X14385767Y1022084D01*
X14381004Y1031606D01*
X14474794Y1088736D02*
Y1093497D01*
X14479555Y1103019D01*
X14484315Y1107780D01*
X14493839Y1112541D01*
X14512881D01*
X14522403Y1107780D01*
X14527164Y1103019D01*
X14531924Y1093497D01*
Y1083975D01*
X14527164Y1074453D01*
X14517642Y1060171D01*
X14470033Y1012562D01*
X14536687D01*
X14429008Y8967940D02*
X14438528Y8972701D01*
X14452812Y8986984D01*
Y8887005D01*
X14586427Y9900845D02*
X14595950Y9905606D01*
X14610233Y9919888D01*
Y9819910D01*
X14721637Y9886562D02*
X14716876Y9872279D01*
X14707355Y9862758D01*
X14693073Y9857997D01*
X14688310D01*
X14674028Y9862758D01*
X14664507Y9872279D01*
X14659746Y9886562D01*
Y9891323D01*
X14664507Y9905606D01*
X14674028Y9915127D01*
X14688310Y9919888D01*
X14693073D01*
X14707355Y9915127D01*
X14716876Y9905606D01*
X14721637Y9886562D01*
Y9862758D01*
X14716876Y9838953D01*
X14707355Y9824671D01*
X14693073Y9819910D01*
X14683549D01*
X14669267Y9824671D01*
X14664507Y9834192D01*
X14625008Y13498442D02*
X14634531Y13503203D01*
X14648811Y13517487D01*
Y13417506D01*
X14390526Y14447548D02*
X14442896D01*
X14414331Y14409460D01*
X14428613D01*
X14438135Y14404700D01*
X14442896Y14399939D01*
X14447656Y14385657D01*
Y14376134D01*
X14442896Y14361852D01*
X14433374Y14352330D01*
X14419092Y14347569D01*
X14404810D01*
X14390526Y14352330D01*
X14385767Y14357091D01*
X14381004Y14366612D01*
X14474794Y14423743D02*
Y14428503D01*
X14479555Y14438026D01*
X14484315Y14442787D01*
X14493839Y14447548D01*
X14512881D01*
X14522403Y14442787D01*
X14527164Y14438026D01*
X14531924Y14428503D01*
Y14418982D01*
X14527164Y14409460D01*
X14517642Y14395178D01*
X14470033Y14347569D01*
X14536687D01*
X13463808Y22302946D02*
X13473329Y22307709D01*
X13487611Y22321991D01*
Y22222012D01*
X14731950Y22450803D02*
Y22350824D01*
Y22403194D02*
X14722429Y22412717D01*
X14712907Y22417477D01*
X14698624D01*
X14689104Y22412717D01*
X14679581Y22403194D01*
X14674820Y22388911D01*
Y22379390D01*
X14679581Y22365108D01*
X14689104Y22355585D01*
X14698624Y22350824D01*
X14712907D01*
X14722429Y22355585D01*
X14731950Y22365108D01*
X14990952Y22416382D02*
X14981429Y22425903D01*
X14971907Y22430664D01*
X14957625D01*
X14948103Y22425903D01*
X14938580Y22416382D01*
X14933820Y22402100D01*
Y22392577D01*
X14938580Y22378294D01*
X14948103Y22368773D01*
X14957625Y22364012D01*
X14971907D01*
X14981429Y22368773D01*
X14990952Y22378294D01*
X15179196Y22450803D02*
Y22350824D01*
Y22403194D02*
X15188718Y22412717D01*
X15198241Y22417477D01*
X15212521D01*
X15222044Y22412717D01*
X15231566Y22403194D01*
X15236327Y22388911D01*
Y22379390D01*
X15231566Y22365108D01*
X15222044Y22355585D01*
X15212521Y22350824D01*
X15198241D01*
X15188718Y22355585D01*
X15179196Y22365108D01*
X15490327Y22428851D02*
Y22362199D01*
Y22414571D02*
X15480804Y22424091D01*
X15471283Y22428851D01*
X15457001D01*
X15447479Y22424091D01*
X15437956Y22414571D01*
X15433195Y22400287D01*
Y22390765D01*
X15437956Y22376483D01*
X15447479Y22366962D01*
X15457001Y22362199D01*
X15471283D01*
X15480804Y22366962D01*
X15490327Y22376483D01*
X15741377Y22430664D02*
X15689008Y22364012D01*
Y22430664D02*
X15741377D01*
X15689008Y22364012D02*
X15741377D01*
X16374835Y11819855D02*
X16365314Y11838898D01*
X16346271Y11857942D01*
X16327226Y11867463D01*
X16289139D01*
X16270094Y11857942D01*
X16251051Y11838898D01*
X16241530Y11819855D01*
X16232008Y11791289D01*
Y11743680D01*
X16241530Y11715115D01*
X16251051Y11696072D01*
X16270094Y11677028D01*
X16289139Y11667506D01*
X16327226D01*
X16346271Y11677028D01*
X16365314Y11696072D01*
X16374835Y11715115D01*
Y11743680D01*
X16327226D02*
X16374835D01*
X16420540Y11867463D02*
Y11667506D01*
Y11867463D02*
X16506236D01*
X16534801Y11857942D01*
X16544324Y11848420D01*
X16553844Y11829376D01*
Y11810333D01*
X16544324Y11791289D01*
X16534801Y11781768D01*
X16506236Y11772246D01*
X16420540D01*
X16487192D02*
X16553844Y11667506D01*
X16598598Y11867463D02*
Y11667506D01*
X16640492Y11867463D02*
Y11667506D01*
Y11867463D02*
X16707146D01*
X16735710Y11857942D01*
X16754755Y11838898D01*
X16764276Y11819855D01*
X16773798Y11791289D01*
Y11743680D01*
X16764276Y11715115D01*
X16754755Y11696072D01*
X16735710Y11677028D01*
X16707146Y11667506D01*
X16640492D01*
X17032790Y11867463D02*
X17013747Y11857942D01*
X16994704Y11838898D01*
X16985181Y11819855D01*
X16975659Y11791289D01*
Y11743680D01*
X16985181Y11715115D01*
X16994704Y11696072D01*
X17013747Y11677028D01*
X17032790Y11667506D01*
X17070877D01*
X17089922Y11677028D01*
X17108965Y11696072D01*
X17118486Y11715115D01*
X17128008Y11743680D01*
Y11791289D01*
X17118486Y11819855D01*
X17108965Y11838898D01*
X17089922Y11857942D01*
X17070877Y11867463D01*
X17032790D01*
X17174664D02*
Y11667506D01*
Y11867463D02*
X17260361D01*
X17288927Y11857942D01*
X17298447Y11848420D01*
X17307970Y11829376D01*
Y11810333D01*
X17298447Y11791289D01*
X17288927Y11781768D01*
X17260361Y11772246D01*
X17174664D01*
X17241318D02*
X17307970Y11667506D01*
X17495547Y11819855D02*
X17486026Y11838898D01*
X17466983Y11857942D01*
X17447939Y11867463D01*
X17409853D01*
X17390810Y11857942D01*
X17371765Y11838898D01*
X17362244Y11819855D01*
X17352722Y11791289D01*
Y11743680D01*
X17362244Y11715115D01*
X17371765Y11696072D01*
X17390810Y11677028D01*
X17409853Y11667506D01*
X17447939D01*
X17466983Y11677028D01*
X17486026Y11696072D01*
X17495547Y11715115D01*
Y11743680D01*
X17447939D02*
X17495547D01*
D54*
X5512309Y5533407D02*
G03*
X5512309Y5533407I-24500J0D01*
G01*
Y5025406D02*
G03*
X5512309Y5025406I-24500J0D01*
G01*
X5258309Y5279406D02*
G03*
X5258309Y5279406I-24500J0D01*
G01*
X5410709Y21713206D02*
G03*
X5410709Y21713206I-24500J0D01*
G01*
Y21205206D02*
G03*
X5410709Y21205206I-24500J0D01*
G01*
X5156709Y21459206D02*
G03*
X5156709Y21459206I-24500J0D01*
G01*
X5410709Y16188707D02*
G03*
X5410709Y16188707I-24500J0D01*
G01*
Y15680705D02*
G03*
X5410709Y15680705I-24500J0D01*
G01*
X5156709Y15934706D02*
G03*
X5156709Y15934706I-24500J0D01*
G01*
X5410709Y10778507D02*
G03*
X5410709Y10778507I-24500J0D01*
G01*
Y10270506D02*
G03*
X5410709Y10270506I-24500J0D01*
G01*
X5156709Y10524506D02*
G03*
X5156709Y10524506I-24500J0D01*
G01*
X5487808Y5533407D02*
Y5633407D01*
Y5533407D02*
X5587808D01*
X5487808Y4925406D02*
Y5025406D01*
X5587808D01*
X5360808Y5179406D02*
Y5279406D01*
X5460808D01*
X5233808Y5179406D02*
Y5279406D01*
X5133808D02*
X5233808D01*
X13289607Y2571106D02*
Y2621106D01*
Y2671106D01*
X13239609Y2621106D02*
X13289607D01*
X13339607D01*
X13789607Y2571106D02*
Y2621106D01*
Y2671106D01*
X13739609Y2621106D02*
X13789607D01*
X13839607D01*
X13289607Y3341106D02*
Y3391106D01*
Y3441106D01*
X13239609Y3391106D02*
X13289607D01*
X13339607D01*
X13789607Y3341106D02*
Y3391106D01*
Y3441106D01*
X13739609Y3391106D02*
X13789607D01*
X13839607D01*
X13539607Y2956106D02*
Y3006106D01*
X13489609D02*
X13539607D01*
X13589607D01*
X13539607D02*
Y3056106D01*
X16000009Y305002D02*
Y9695007D01*
X15724010Y9445007D02*
X15824010D01*
X15724010Y9345006D02*
Y9445007D01*
X15470009Y8937006D02*
X15570009D01*
X15470009Y8837006D02*
Y8937006D01*
X14962009D02*
X15062009D01*
X14962009Y8837006D02*
Y8937006D01*
Y1063002D02*
X15062009D01*
X14962009Y963002D02*
Y1063002D01*
X15470009D02*
X15570009D01*
X15470009Y963002D02*
Y1063002D01*
X15724010Y555002D02*
X15824010D01*
X15724010Y455002D02*
Y555002D01*
X14962009Y5000004D02*
X16734009Y5000006D01*
X13844408Y1063006D02*
X13944408D01*
X13744408D02*
X13844408D01*
Y963006D02*
Y1063006D01*
Y1163006D01*
X13471335Y1015451D02*
X13560435Y1060851D01*
X13649538Y1106250D01*
X13515038Y1149951D02*
X13560435Y1060851D01*
X13605835Y971750D01*
X14039281Y1019763D02*
X14128381Y1065162D01*
X14217482Y1110561D01*
X14082982Y1154263D02*
X14128381Y1065162D01*
X14173779Y976061D01*
X12244209Y3184706D02*
Y3234707D01*
X12194209D02*
X12244209D01*
Y3284706D01*
Y3234707D02*
X12294209D01*
X12244209Y2676706D02*
Y2726706D01*
X12194209D02*
X12244209D01*
Y2776706D01*
Y2726706D02*
X12294209D01*
X12244209Y1914706D02*
Y1964706D01*
X12194209D02*
X12244209D01*
Y2014706D01*
Y1964706D02*
X12294209D01*
X10212208Y1914706D02*
Y1964706D01*
X10162208D02*
X10212208D01*
Y2014706D01*
Y1964706D02*
X10262208D01*
X10212208Y3946707D02*
Y3996707D01*
X10162208D02*
X10212208D01*
Y4046707D01*
Y3996707D02*
X10262208D01*
X10212208Y2930706D02*
Y2980706D01*
X10162208D02*
X10212208D01*
Y3030706D01*
Y2980706D02*
X10262208D01*
X11228208Y2930706D02*
Y2980706D01*
X11178208D02*
X11228208D01*
Y3030706D01*
Y2980706D02*
X11278209D01*
X4090408Y3692106D02*
X6580408D01*
X4090408Y3082106D02*
X6580408D01*
X4090408D02*
Y3692106D01*
X6580408Y3082106D02*
Y3692106D01*
X566093Y1698005D02*
X666093D01*
X466093D02*
X566093D01*
Y1798005D01*
Y1598005D02*
Y1698005D01*
Y5457207D02*
X666093D01*
X466093D02*
X566093D01*
Y5557207D01*
Y5357207D02*
Y5457207D01*
X756613Y4530106D02*
X856613D01*
X656613D02*
X756613D01*
Y4630106D01*
Y4430106D02*
Y4530106D01*
X376524D02*
X476524D01*
X276524D02*
X376524D01*
Y4630106D01*
Y4430106D02*
Y4530106D01*
X185093Y4657106D02*
X285093D01*
X85093D02*
X185093D01*
Y4757106D01*
Y4557106D02*
Y4657106D01*
X566113D02*
X666113D01*
X466113D02*
X566113D01*
Y4757106D01*
Y4557106D02*
Y4657106D01*
X756613Y4276106D02*
X856613D01*
X656613D02*
X756613D01*
Y4376106D01*
Y4176106D02*
Y4276106D01*
X376524D02*
X476524D01*
X276524D02*
X376524D01*
Y4376106D01*
Y4176106D02*
Y4276106D01*
X185093Y4403106D02*
X285093D01*
X85093D02*
X185093D01*
Y4503106D01*
Y4303106D02*
Y4403106D01*
X566113D02*
X666113D01*
X466113D02*
X566113D01*
Y4503106D01*
Y4303106D02*
Y4403106D01*
X756613Y4022106D02*
X856613D01*
X656613D02*
X756613D01*
Y4122106D01*
Y3922106D02*
Y4022106D01*
X376524D02*
X476524D01*
X276524D02*
X376524D01*
Y4122106D01*
Y3922106D02*
Y4022106D01*
X185093Y4149106D02*
X285093D01*
X85093D02*
X185093D01*
Y4249106D01*
Y4049106D02*
Y4149106D01*
X566113D02*
X666113D01*
X466113D02*
X566113D01*
Y4249106D01*
Y4049106D02*
Y4149106D01*
X756613Y3768106D02*
X856613D01*
X656613D02*
X756613D01*
Y3868106D01*
Y3668106D02*
Y3768106D01*
X376524D02*
X476524D01*
X276524D02*
X376524D01*
Y3868106D01*
Y3668106D02*
Y3768106D01*
X185093Y3895106D02*
X285093D01*
X85093D02*
X185093D01*
Y3995106D01*
Y3795106D02*
Y3895106D01*
X566113D02*
X666113D01*
X466113D02*
X566113D01*
Y3995106D01*
Y3795106D02*
Y3895106D01*
X756613Y3514106D02*
X856613D01*
X656613D02*
X756613D01*
Y3614106D01*
Y3414106D02*
Y3514106D01*
X376524D02*
X476524D01*
X276524D02*
X376524D01*
Y3614106D01*
Y3414106D02*
Y3514106D01*
X185093Y3641106D02*
X285093D01*
X85093D02*
X185093D01*
Y3741106D01*
Y3541106D02*
Y3641106D01*
X566113D02*
X666113D01*
X466113D02*
X566113D01*
Y3741106D01*
Y3541106D02*
Y3641106D01*
X756613Y3260105D02*
X856613D01*
X656613D02*
X756613D01*
Y3360106D01*
Y3160105D02*
Y3260105D01*
X376524D02*
X476524D01*
X276524D02*
X376524D01*
Y3360106D01*
Y3160105D02*
Y3260105D01*
X185093Y3387106D02*
X285093D01*
X85093D02*
X185093D01*
Y3487106D01*
Y3287106D02*
Y3387106D01*
X566113D02*
X666113D01*
X466113D02*
X566113D01*
Y3487106D01*
Y3287106D02*
Y3387106D01*
X756613Y3006105D02*
X856613D01*
X656613D02*
X756613D01*
Y3106106D01*
Y2906105D02*
Y3006105D01*
X376524D02*
X476524D01*
X276524D02*
X376524D01*
Y3106106D01*
Y2906105D02*
Y3006105D01*
X185093Y3133105D02*
X285093D01*
X85093D02*
X185093D01*
Y3233106D01*
Y3033105D02*
Y3133105D01*
X566113D02*
X666113D01*
X466113D02*
X566113D01*
Y3233106D01*
Y3033105D02*
Y3133105D01*
X756613Y2752105D02*
X856613D01*
X656613D02*
X756613D01*
Y2852105D01*
Y2652105D02*
Y2752105D01*
X376524D02*
X476524D01*
X276524D02*
X376524D01*
Y2852105D01*
Y2652105D02*
Y2752105D01*
X185093Y2879105D02*
X285093D01*
X85093D02*
X185093D01*
Y2979106D01*
Y2779105D02*
Y2879105D01*
X566113D02*
X666113D01*
X466113D02*
X566113D01*
Y2979106D01*
Y2779105D02*
Y2879105D01*
X756613Y2498105D02*
X856613D01*
X656613D02*
X756613D01*
Y2598105D01*
Y2398105D02*
Y2498105D01*
X376524D02*
X476524D01*
X276524D02*
X376524D01*
Y2598105D01*
Y2398105D02*
Y2498105D01*
X185093Y2625105D02*
X285093D01*
X85093D02*
X185093D01*
Y2725105D01*
Y2525105D02*
Y2625105D01*
X566113D02*
X666113D01*
X466113D02*
X566113D01*
Y2725105D01*
Y2525105D02*
Y2625105D01*
X280808Y3577606D02*
X380808D01*
X180808D02*
X280808D01*
Y3677606D01*
Y3477606D02*
Y3577606D01*
X16000009Y13640002D02*
Y23030006D01*
X15724010Y22780006D02*
X15824010D01*
X15724010Y22680006D02*
Y22780006D01*
X15470009Y22272006D02*
X15570009D01*
X15470009Y22172006D02*
Y22272006D01*
X14962009D02*
X15062009D01*
X14962009Y22172006D02*
Y22272006D01*
Y14398003D02*
X15062009D01*
X14962009Y14298003D02*
Y14398003D01*
X15470009D02*
X15570009D01*
X15470009Y14298003D02*
Y14398003D01*
X15724010Y13890002D02*
X15824010D01*
X15724010Y13790002D02*
Y13890002D01*
X14962009Y18335004D02*
X16734009Y18335007D01*
X566093Y17865106D02*
X666093D01*
X466093D02*
X566093D01*
Y17965106D01*
Y17765106D02*
Y17865106D01*
Y21624307D02*
X666093D01*
X466093D02*
X566093D01*
Y21724307D01*
Y21524307D02*
Y21624307D01*
X756613Y20697208D02*
X856613D01*
X656613D02*
X756613D01*
Y20797208D01*
Y20597208D02*
Y20697208D01*
X376524D02*
X476524D01*
X276524D02*
X376524D01*
Y20797208D01*
Y20597208D02*
Y20697208D01*
X185093Y20824208D02*
X285093D01*
X85093D02*
X185093D01*
Y20924208D01*
Y20724208D02*
Y20824208D01*
X566113D02*
X666113D01*
X466113D02*
X566113D01*
Y20924208D01*
Y20724208D02*
Y20824208D01*
X756613Y20443208D02*
X856613D01*
X656613D02*
X756613D01*
Y20543208D01*
Y20343207D02*
Y20443208D01*
X376524D02*
X476524D01*
X276524D02*
X376524D01*
Y20543208D01*
Y20343207D02*
Y20443208D01*
X185093Y20570209D02*
X285093D01*
X85093D02*
X185093D01*
Y20670209D01*
Y20470209D02*
Y20570209D01*
X566113D02*
X666113D01*
X466113D02*
X566113D01*
Y20670209D01*
Y20470209D02*
Y20570209D01*
X756613Y20189207D02*
X856613D01*
X656613D02*
X756613D01*
Y20289207D01*
Y20089207D02*
Y20189207D01*
X376524D02*
X476524D01*
X276524D02*
X376524D01*
Y20289207D01*
Y20089207D02*
Y20189207D01*
X185093Y20316208D02*
X285093D01*
X85093D02*
X185093D01*
Y20416208D01*
Y20216206D02*
Y20316208D01*
X566113D02*
X666113D01*
X466113D02*
X566113D01*
Y20416208D01*
Y20216206D02*
Y20316208D01*
X756613Y19935207D02*
X856613D01*
X656613D02*
X756613D01*
Y20035207D01*
Y19835207D02*
Y19935207D01*
X376524D02*
X476524D01*
X276524D02*
X376524D01*
Y20035207D01*
Y19835207D02*
Y19935207D01*
X185093Y20062209D02*
X285093D01*
X85093D02*
X185093D01*
Y20162209D01*
Y19962207D02*
Y20062209D01*
X566113D02*
X666113D01*
X466113D02*
X566113D01*
Y20162209D01*
Y19962207D02*
Y20062209D01*
X756613Y19681207D02*
X856613D01*
X656613D02*
X756613D01*
Y19781207D01*
Y19581207D02*
Y19681207D01*
X376524D02*
X476524D01*
X276524D02*
X376524D01*
Y19781207D01*
Y19581207D02*
Y19681207D01*
X185093Y19808208D02*
X285093D01*
X85093D02*
X185093D01*
Y19908208D01*
Y19708208D02*
Y19808208D01*
X566113D02*
X666113D01*
X466113D02*
X566113D01*
Y19908208D01*
Y19708208D02*
Y19808208D01*
X756613Y19427206D02*
X856613D01*
X656613D02*
X756613D01*
Y19527206D01*
Y19327206D02*
Y19427206D01*
X376524D02*
X476524D01*
X276524D02*
X376524D01*
Y19527206D01*
Y19327206D02*
Y19427206D01*
X185093Y19554207D02*
X285093D01*
X85093D02*
X185093D01*
Y19654207D01*
Y19454207D02*
Y19554207D01*
X566113D02*
X666113D01*
X466113D02*
X566113D01*
Y19654207D01*
Y19454207D02*
Y19554207D01*
X756613Y19173207D02*
X856613D01*
X656613D02*
X756613D01*
Y19273207D01*
Y19073207D02*
Y19173207D01*
X376524D02*
X476524D01*
X276524D02*
X376524D01*
Y19273207D01*
Y19073207D02*
Y19173207D01*
X185093Y19300208D02*
X285093D01*
X85093D02*
X185093D01*
Y19400208D01*
Y19200208D02*
Y19300208D01*
X566113D02*
X666113D01*
X466113D02*
X566113D01*
Y19400208D01*
Y19200208D02*
Y19300208D01*
X756613Y18919206D02*
X856613D01*
X656613D02*
X756613D01*
Y19019206D01*
Y18819206D02*
Y18919206D01*
X376524D02*
X476524D01*
X276524D02*
X376524D01*
Y19019206D01*
Y18819206D02*
Y18919206D01*
X185093Y19046207D02*
X285093D01*
X85093D02*
X185093D01*
Y19146207D01*
Y18946207D02*
Y19046207D01*
X566113D02*
X666113D01*
X466113D02*
X566113D01*
Y19146207D01*
Y18946207D02*
Y19046207D01*
X756613Y18665207D02*
X856613D01*
X656613D02*
X756613D01*
Y18765207D01*
Y18565207D02*
Y18665207D01*
X376524D02*
X476524D01*
X276524D02*
X376524D01*
Y18765207D01*
Y18565207D02*
Y18665207D01*
X185093Y18792207D02*
X285093D01*
X85093D02*
X185093D01*
Y18892207D01*
Y18692207D02*
Y18792207D01*
X566113D02*
X666113D01*
X466113D02*
X566113D01*
Y18892207D01*
Y18692207D02*
Y18792207D01*
X280808Y19744707D02*
X380808D01*
X180808D02*
X280808D01*
Y19844707D01*
Y19644707D02*
Y19744707D01*
X566093Y12480304D02*
X666093D01*
X466093D02*
X566093D01*
Y12580304D01*
Y12380304D02*
Y12480304D01*
Y16239507D02*
X666093D01*
X466093D02*
X566093D01*
Y16339507D01*
Y16139507D02*
Y16239507D01*
X756613Y15312405D02*
X856613D01*
X656613D02*
X756613D01*
Y15412405D01*
Y15212405D02*
Y15312405D01*
X376524D02*
X476524D01*
X276524D02*
X376524D01*
Y15412405D01*
Y15212405D02*
Y15312405D01*
X185093Y15439406D02*
X285093D01*
X85093D02*
X185093D01*
Y15539406D01*
Y15339406D02*
Y15439406D01*
X566113D02*
X666113D01*
X466113D02*
X566113D01*
Y15539406D01*
Y15339406D02*
Y15439406D01*
X756613Y15058405D02*
X856613D01*
X656613D02*
X756613D01*
Y15158406D01*
Y14958405D02*
Y15058405D01*
X376524D02*
X476524D01*
X276524D02*
X376524D01*
Y15158406D01*
Y14958405D02*
Y15058405D01*
X185093Y15185406D02*
X285093D01*
X85093D02*
X185093D01*
Y15285406D01*
Y15085406D02*
Y15185406D01*
X566113D02*
X666113D01*
X466113D02*
X566113D01*
Y15285406D01*
Y15085406D02*
Y15185406D01*
X756613Y14804405D02*
X856613D01*
X656613D02*
X756613D01*
Y14904407D01*
Y14704405D02*
Y14804405D01*
X376524D02*
X476524D01*
X276524D02*
X376524D01*
Y14904407D01*
Y14704405D02*
Y14804405D01*
X185093Y14931406D02*
X285093D01*
X85093D02*
X185093D01*
Y15031406D01*
Y14831406D02*
Y14931406D01*
X566113D02*
X666113D01*
X466113D02*
X566113D01*
Y15031406D01*
Y14831406D02*
Y14931406D01*
X756613Y14550404D02*
X856613D01*
X656613D02*
X756613D01*
Y14650404D01*
Y14450404D02*
Y14550404D01*
X376524D02*
X476524D01*
X276524D02*
X376524D01*
Y14650404D01*
Y14450404D02*
Y14550404D01*
X185093Y14677405D02*
X285093D01*
X85093D02*
X185093D01*
Y14777406D01*
Y14577405D02*
Y14677405D01*
X566113D02*
X666113D01*
X466113D02*
X566113D01*
Y14777406D01*
Y14577405D02*
Y14677405D01*
X756613Y14296405D02*
X856613D01*
X656613D02*
X756613D01*
Y14396405D01*
Y14196405D02*
Y14296405D01*
X376524D02*
X476524D01*
X276524D02*
X376524D01*
Y14396405D01*
Y14196405D02*
Y14296405D01*
X185093Y14423405D02*
X285093D01*
X85093D02*
X185093D01*
Y14523405D01*
Y14323405D02*
Y14423405D01*
X566113D02*
X666113D01*
X466113D02*
X566113D01*
Y14523405D01*
Y14323405D02*
Y14423405D01*
X756613Y14042406D02*
X856613D01*
X656613D02*
X756613D01*
Y14142406D01*
Y13942406D02*
Y14042406D01*
X376524D02*
X476524D01*
X276524D02*
X376524D01*
Y14142406D01*
Y13942406D02*
Y14042406D01*
X185093Y14169405D02*
X285093D01*
X85093D02*
X185093D01*
Y14269405D01*
Y14069405D02*
Y14169405D01*
X566113D02*
X666113D01*
X466113D02*
X566113D01*
Y14269405D01*
Y14069405D02*
Y14169405D01*
X756613Y13788405D02*
X856613D01*
X656613D02*
X756613D01*
Y13888405D01*
Y13688405D02*
Y13788405D01*
X376524D02*
X476524D01*
X276524D02*
X376524D01*
Y13888405D01*
Y13688405D02*
Y13788405D01*
X185093Y13915405D02*
X285093D01*
X85093D02*
X185093D01*
Y14015405D01*
Y13815405D02*
Y13915405D01*
X566113D02*
X666113D01*
X466113D02*
X566113D01*
Y14015405D01*
Y13815405D02*
Y13915405D01*
X756613Y13534406D02*
X856613D01*
X656613D02*
X756613D01*
Y13634406D01*
Y13434406D02*
Y13534406D01*
X376524D02*
X476524D01*
X276524D02*
X376524D01*
Y13634406D01*
Y13434406D02*
Y13534406D01*
X185093Y13661404D02*
X285093D01*
X85093D02*
X185093D01*
Y13761404D01*
Y13561404D02*
Y13661404D01*
X566113D02*
X666113D01*
X466113D02*
X566113D01*
Y13761404D01*
Y13561404D02*
Y13661404D01*
X756613Y13280405D02*
X856613D01*
X656613D02*
X756613D01*
Y13380405D01*
Y13180405D02*
Y13280405D01*
X376524D02*
X476524D01*
X276524D02*
X376524D01*
Y13380405D01*
Y13180405D02*
Y13280405D01*
X185093Y13407405D02*
X285093D01*
X85093D02*
X185093D01*
Y13507405D01*
Y13307405D02*
Y13407405D01*
X566113D02*
X666113D01*
X466113D02*
X566113D01*
Y13507405D01*
Y13307405D02*
Y13407405D01*
X280808Y14359904D02*
X380808D01*
X180808D02*
X280808D01*
Y14459904D01*
Y14259904D02*
Y14359904D01*
X566093Y7108206D02*
X666093D01*
X466093D02*
X566093D01*
Y7208206D01*
Y7008206D02*
Y7108206D01*
Y10867408D02*
X666093D01*
X466093D02*
X566093D01*
Y10967408D01*
Y10767408D02*
Y10867408D01*
X756613Y9940307D02*
X856613D01*
X656613D02*
X756613D01*
Y10040307D01*
Y9840307D02*
Y9940307D01*
X376524D02*
X476524D01*
X276524D02*
X376524D01*
Y10040307D01*
Y9840307D02*
Y9940307D01*
X185093Y10067307D02*
X285093D01*
X85093D02*
X185093D01*
Y10167307D01*
Y9967307D02*
Y10067307D01*
X566113D02*
X666113D01*
X466113D02*
X566113D01*
Y10167307D01*
Y9967307D02*
Y10067307D01*
X756613Y9686307D02*
X856613D01*
X656613D02*
X756613D01*
Y9786307D01*
Y9586307D02*
Y9686307D01*
X376524D02*
X476524D01*
X276524D02*
X376524D01*
Y9786307D01*
Y9586307D02*
Y9686307D01*
X185093Y9813307D02*
X285093D01*
X85093D02*
X185093D01*
Y9913307D01*
Y9713307D02*
Y9813307D01*
X566113D02*
X666113D01*
X466113D02*
X566113D01*
Y9913307D01*
Y9713307D02*
Y9813307D01*
X756613Y9432307D02*
X856613D01*
X656613D02*
X756613D01*
Y9532307D01*
Y9332307D02*
Y9432307D01*
X376524D02*
X476524D01*
X276524D02*
X376524D01*
Y9532307D01*
Y9332307D02*
Y9432307D01*
X185093Y9559307D02*
X285093D01*
X85093D02*
X185093D01*
Y9659307D01*
Y9459307D02*
Y9559307D01*
X566113D02*
X666113D01*
X466113D02*
X566113D01*
Y9659307D01*
Y9459307D02*
Y9559307D01*
X756613Y9178307D02*
X856613D01*
X656613D02*
X756613D01*
Y9278307D01*
Y9078307D02*
Y9178307D01*
X376524D02*
X476524D01*
X276524D02*
X376524D01*
Y9278307D01*
Y9078307D02*
Y9178307D01*
X185093Y9305307D02*
X285093D01*
X85093D02*
X185093D01*
Y9405307D01*
Y9205307D02*
Y9305307D01*
X566113D02*
X666113D01*
X466113D02*
X566113D01*
Y9405307D01*
Y9205307D02*
Y9305307D01*
X756613Y8924307D02*
X856613D01*
X656613D02*
X756613D01*
Y9024307D01*
Y8824307D02*
Y8924307D01*
X376524D02*
X476524D01*
X276524D02*
X376524D01*
Y9024307D01*
Y8824307D02*
Y8924307D01*
X185093Y9051307D02*
X285093D01*
X85093D02*
X185093D01*
Y9151307D01*
Y8951307D02*
Y9051307D01*
X566113D02*
X666113D01*
X466113D02*
X566113D01*
Y9151307D01*
Y8951307D02*
Y9051307D01*
X756613Y8670307D02*
X856613D01*
X656613D02*
X756613D01*
Y8770307D01*
Y8570306D02*
Y8670307D01*
X376524D02*
X476524D01*
X276524D02*
X376524D01*
Y8770307D01*
Y8570306D02*
Y8670307D01*
X185093Y8797307D02*
X285093D01*
X85093D02*
X185093D01*
Y8897307D01*
Y8697307D02*
Y8797307D01*
X566113D02*
X666113D01*
X466113D02*
X566113D01*
Y8897307D01*
Y8697307D02*
Y8797307D01*
X756613Y8416307D02*
X856613D01*
X656613D02*
X756613D01*
Y8516307D01*
Y8316306D02*
Y8416307D01*
X376524D02*
X476524D01*
X276524D02*
X376524D01*
Y8516307D01*
Y8316306D02*
Y8416307D01*
X185093Y8543307D02*
X285093D01*
X85093D02*
X185093D01*
Y8643307D01*
Y8443306D02*
Y8543307D01*
X566113D02*
X666113D01*
X466113D02*
X566113D01*
Y8643307D01*
Y8443306D02*
Y8543307D01*
X756613Y8162306D02*
X856613D01*
X656613D02*
X756613D01*
Y8262306D01*
Y8062306D02*
Y8162306D01*
X376524D02*
X476524D01*
X276524D02*
X376524D01*
Y8262306D01*
Y8062306D02*
Y8162306D01*
X185093Y8289307D02*
X285093D01*
X85093D02*
X185093D01*
Y8389307D01*
Y8189306D02*
Y8289307D01*
X566113D02*
X666113D01*
X466113D02*
X566113D01*
Y8389307D01*
Y8189306D02*
Y8289307D01*
X756613Y7908306D02*
X856613D01*
X656613D02*
X756613D01*
Y8008306D01*
Y7808306D02*
Y7908306D01*
X376524D02*
X476524D01*
X276524D02*
X376524D01*
Y8008306D01*
Y7808306D02*
Y7908306D01*
X185093Y8035306D02*
X285093D01*
X85093D02*
X185093D01*
Y8135306D01*
Y7935306D02*
Y8035306D01*
X566113D02*
X666113D01*
X466113D02*
X566113D01*
Y8135306D01*
Y7935306D02*
Y8035306D01*
X280808Y8987807D02*
X380808D01*
X180808D02*
X280808D01*
Y9087807D01*
Y8887807D02*
Y8987807D01*
X3659408Y17382306D02*
Y17992307D01*
X1169408Y17382306D02*
Y17992307D01*
Y17382306D02*
X3659408D01*
X1169408Y17992307D02*
X3659408D01*
X1169408Y19846506D02*
X3659408D01*
X1169408Y19236507D02*
X3659408D01*
X1169408D02*
Y19846506D01*
X3659408Y19236507D02*
Y19846506D01*
X6580408Y17382306D02*
Y17992307D01*
X4090408Y17382306D02*
Y17992307D01*
Y17382306D02*
X6580408D01*
X4090408Y17992307D02*
X6580408D01*
X4090408Y19846506D02*
X6580408D01*
X4090408Y19236507D02*
X6580408D01*
X4090408D02*
Y19846506D01*
X6580408Y19236507D02*
Y19846506D01*
X1169408Y12607506D02*
X3659408D01*
X1169408Y11997506D02*
X3659408D01*
X1169408D02*
Y12607506D01*
X3659408Y11997506D02*
Y12607506D01*
X1169408Y14474405D02*
X3659408D01*
X1169408Y13864404D02*
X3659408D01*
X1169408D02*
Y14474405D01*
X3659408Y13864404D02*
Y14474405D01*
X4090408Y12607506D02*
X6580408D01*
X4090408Y11997506D02*
X6580408D01*
X4090408D02*
Y12607506D01*
X6580408Y11997506D02*
Y12607506D01*
X4090408Y14474406D02*
X6580408D01*
X4090408Y13864406D02*
X6580408D01*
X4090408D02*
Y14474406D01*
X6580408Y13864406D02*
Y14474406D01*
X1169408Y7235406D02*
X3659408D01*
X1169408Y6625406D02*
X3659408D01*
X1169408D02*
Y7235406D01*
X3659408Y6625406D02*
Y7235406D01*
X1169408Y9102307D02*
X3659408D01*
X1169408Y8492307D02*
X3659408D01*
X1169408D02*
Y9102307D01*
X3659408Y8492307D02*
Y9102307D01*
X4090408Y7235406D02*
X6580408D01*
X4090408Y6625406D02*
X6580408D01*
X4090408D02*
Y7235406D01*
X6580408Y6625406D02*
Y7235406D01*
X4090408Y9102306D02*
X6580408D01*
X4090408Y8492306D02*
X6580408D01*
X4090408D02*
Y9102306D01*
X6580408Y8492306D02*
Y9102306D01*
X1169408Y1825206D02*
X3659408D01*
X1169408Y1215206D02*
X3659408D01*
X1169408D02*
Y1825206D01*
X3659408Y1215206D02*
Y1825206D01*
X1194808Y3692106D02*
X3684808D01*
X1194808Y3082106D02*
X3684808D01*
X1194808D02*
Y3692106D01*
X3684808Y3082106D02*
Y3692106D01*
X4090408Y1825206D02*
X6580408D01*
X4090408Y1215206D02*
X6580408D01*
X4090408D02*
Y1825206D01*
X6580408Y1215206D02*
Y1825206D01*
X5386208Y21713206D02*
Y21813206D01*
Y21713206D02*
X5486208D01*
X5386208Y21105206D02*
Y21205206D01*
X5486208D01*
X5259208Y21359206D02*
Y21459206D01*
X5359208D01*
X5132208Y21359206D02*
Y21459206D01*
X5032208D02*
X5132208D01*
X5386208Y16188707D02*
Y16288707D01*
Y16188707D02*
X5486208D01*
X5386208Y15580705D02*
Y15680705D01*
X5486208D01*
X5259208Y15834706D02*
Y15934706D01*
X5359208D01*
X5132208Y15834706D02*
Y15934706D01*
X5032208D02*
X5132208D01*
X5386208Y10778507D02*
Y10878507D01*
Y10778507D02*
X5486208D01*
X5386208Y10170506D02*
Y10270506D01*
X5486208D01*
X5259208Y10424506D02*
Y10524506D01*
X5359208D01*
X5132208Y10424506D02*
Y10524506D01*
X5032208D02*
X5132208D01*
X9323208Y3996706D02*
X9423208D01*
X9223208D02*
X9323208D01*
Y3896706D02*
Y3996706D01*
Y4096706D01*
X8950135Y3949151D02*
X9039236Y3994551D01*
X9128337Y4039950D01*
X8993837Y4083651D02*
X9039236Y3994551D01*
X9084635Y3905450D01*
X9518080Y3953463D02*
X9607181Y3998862D01*
X9696282Y4044261D01*
X9561782Y4087963D02*
X9607181Y3998862D01*
X9652580Y3909761D01*
X9323208Y1964706D02*
X9423208D01*
X9223208D02*
X9323208D01*
Y1864706D02*
Y1964706D01*
Y2064706D01*
X8950135Y1917151D02*
X9039236Y1962551D01*
X9128337Y2007950D01*
X8993837Y2051651D02*
X9039236Y1962551D01*
X9084635Y1873450D01*
X9518080Y1921463D02*
X9607181Y1966862D01*
X9696282Y2012261D01*
X9561782Y2055963D02*
X9607181Y1966862D01*
X9652580Y1877761D01*
D55*
X8042335Y22575356D02*
X9629835D01*
X8042335Y21813354D02*
X9629835D01*
X8042335D02*
Y22575356D01*
X9629835Y21813354D01*
X8042335D02*
X9629835Y22575356D01*
%TF.MD5,20e09eb1d58924f89a666c1c114852c1*%
M02*
