%TF.GenerationSoftware,Altium Limited,Altium Designer,19.1.5 (86)*%
G04 Layer_Color=16711935*
%FSLAX26Y26*%
%MOIN*%
%TF.FileFunction,Other,Corners*%
%TF.Part,Single*%
G01*
G75*
%TA.AperFunction,NonConductor*%
%ADD12C,0.010000*%
D12*
X3136581Y-1274002D02*
Y-1074002D01*
X2936581Y-1274002D02*
Y-1074002D01*
Y-1274002D02*
X3736581D01*
X3536581D02*
Y-1074002D01*
X2936581D02*
X3736581D01*
Y-1274002D02*
Y-1074002D01*
X3336581Y-1274002D02*
Y-1074002D01*
%TF.MD5,c9e0f750416e190f4e3875de7a4036ae*%
M02*
