Removed Pin From Net: NetName=18/5I- Pin=J111b-1
Removed Pin From Net: NetName=18/5I+ Pin=J111b-2
Removed Pin From Net: NetName=18/5V- Pin=J111b-3
Removed Pin From Net: NetName=18/5V+ Pin=J111b-4
Added Pin To Net: NetName=22/5I- Pin=J111b-1
Added Pin To Net: NetName=22/5I+ Pin=J111b-2
Added Pin To Net: NetName=22/5V- Pin=J111b-3
Added Pin To Net: NetName=22/5V+ Pin=J111b-4
