%TF.GenerationSoftware,Altium Limited,Altium Designer,19.1.5 (86)*%
G04 Layer_Color=8388736*
%FSLAX45Y45*%
%MOMM*%
%TF.FileFunction,Soldermask,Top*%
%TF.Part,Single*%
G01*
G75*
%TA.AperFunction,NonConductor*%
%ADD15C,0.17780*%
%TA.AperFunction,ComponentPad*%
%ADD16C,3.80000*%
%ADD17C,2.00000*%
%ADD18C,1.60000*%
%ADD19C,4.60000*%
%TA.AperFunction,ViaPad*%
%ADD20C,4.45000*%
%TA.AperFunction,ComponentPad*%
%ADD21R,1.60000X1.60000*%
%ADD22C,2.50000*%
%ADD23C,1.70000*%
%ADD24C,3.50000*%
%TA.AperFunction,ViaPad*%
%ADD25C,1.30000*%
%TA.AperFunction,NonConductor*%
%ADD31R,424.64506X6.56501*%
D15*
X14541486Y4698959D02*
Y4508500D01*
X14478000Y4698959D02*
X14604973D01*
X14672993Y4635473D02*
X14654855Y4626403D01*
X14636716Y4608264D01*
X14627646Y4581056D01*
Y4562917D01*
X14636716Y4535708D01*
X14654855Y4517570D01*
X14672993Y4508500D01*
X14700201D01*
X14718341Y4517570D01*
X14736481Y4535708D01*
X14745551Y4562917D01*
Y4581056D01*
X14736481Y4608264D01*
X14718341Y4626403D01*
X14700201Y4635473D01*
X14672993D01*
X14787270D02*
Y4445014D01*
Y4608264D02*
X14805408Y4626403D01*
X14823547Y4635473D01*
X14850755D01*
X14868895Y4626403D01*
X14887035Y4608264D01*
X14896103Y4581056D01*
Y4562917D01*
X14887035Y4535708D01*
X14868895Y4517570D01*
X14850755Y4508500D01*
X14823547D01*
X14805408Y4517570D01*
X14787270Y4535708D01*
X15213535Y4671751D02*
X15195396Y4689890D01*
X15168188Y4698959D01*
X15131911D01*
X15104701Y4689890D01*
X15086562Y4671751D01*
Y4653612D01*
X15095631Y4635473D01*
X15104701Y4626403D01*
X15122839Y4617334D01*
X15177257Y4599195D01*
X15195396Y4590125D01*
X15204465Y4581056D01*
X15213535Y4562917D01*
Y4535708D01*
X15195396Y4517570D01*
X15168188Y4508500D01*
X15131911D01*
X15104701Y4517570D01*
X15086562Y4535708D01*
X15301509Y4635473D02*
X15283369Y4626403D01*
X15265231Y4608264D01*
X15256161Y4581056D01*
Y4562917D01*
X15265231Y4535708D01*
X15283369Y4517570D01*
X15301509Y4508500D01*
X15328717D01*
X15346857Y4517570D01*
X15364995Y4535708D01*
X15374065Y4562917D01*
Y4581056D01*
X15364995Y4608264D01*
X15346857Y4626403D01*
X15328717Y4635473D01*
X15301509D01*
X15415785Y4698959D02*
Y4508500D01*
X15564523Y4698959D02*
Y4508500D01*
Y4608264D02*
X15546385Y4626403D01*
X15528246Y4635473D01*
X15501038D01*
X15482899Y4626403D01*
X15464760Y4608264D01*
X15455690Y4581056D01*
Y4562917D01*
X15464760Y4535708D01*
X15482899Y4517570D01*
X15501038Y4508500D01*
X15528246D01*
X15546385Y4517570D01*
X15564523Y4535708D01*
X15615314Y4581056D02*
X15724147D01*
Y4599195D01*
X15715079Y4617334D01*
X15706007Y4626403D01*
X15687869Y4635473D01*
X15660661D01*
X15642522Y4626403D01*
X15624384Y4608264D01*
X15615314Y4581056D01*
Y4562917D01*
X15624384Y4535708D01*
X15642522Y4517570D01*
X15660661Y4508500D01*
X15687869D01*
X15706007Y4517570D01*
X15724147Y4535708D01*
X15764960Y4635473D02*
Y4508500D01*
Y4581056D02*
X15774030Y4608264D01*
X15792168Y4626403D01*
X15810307Y4635473D01*
X15837515D01*
D16*
X44829199Y8826500D02*
D03*
X43619199D02*
D03*
D17*
X44049200D02*
D03*
X44399200D02*
D03*
D18*
X46354999Y11049000D02*
D03*
Y10033000D02*
D03*
X47087000Y15878000D02*
D03*
X46832999D02*
D03*
X47087000Y15624001D02*
D03*
X46832999D02*
D03*
X47087000Y15370000D02*
D03*
X46832999D02*
D03*
X47087000Y15116000D02*
D03*
X46832999D02*
D03*
X47087000Y16132001D02*
D03*
X46832999D02*
D03*
X47087000Y16386000D02*
D03*
X46832999D02*
D03*
X47087000Y16639999D02*
D03*
X46832999D02*
D03*
X47087000Y16894000D02*
D03*
X46832999D02*
D03*
X47087000Y12576000D02*
D03*
X46832999D02*
D03*
X47087000Y12322000D02*
D03*
X46832999D02*
D03*
Y11560000D02*
D03*
Y12068000D02*
D03*
X47087000D02*
D03*
Y11814000D02*
D03*
X46832999D02*
D03*
X47087000Y11560000D02*
D03*
Y11306000D02*
D03*
X46832999D02*
D03*
X47087000Y11052000D02*
D03*
X46832999D02*
D03*
Y12830000D02*
D03*
X47087000D02*
D03*
X46832999Y13084001D02*
D03*
X47087000D02*
D03*
X46832999Y13338000D02*
D03*
X47087000D02*
D03*
Y13592001D02*
D03*
X46832999Y13846001D02*
D03*
X47087000D02*
D03*
Y14100002D02*
D03*
X46832999D02*
D03*
Y13592001D02*
D03*
Y14354002D02*
D03*
X47087000D02*
D03*
X46832999Y14608002D02*
D03*
X47087000D02*
D03*
Y14862003D02*
D03*
X46832999Y17148000D02*
D03*
X47087000D02*
D03*
X46832999Y14862003D02*
D03*
X46024799Y10287000D02*
D03*
Y10541000D02*
D03*
Y10033000D02*
D03*
X45262799D02*
D03*
Y10287000D02*
D03*
X44831000Y10807700D02*
D03*
Y9791700D02*
D03*
X25626999Y15878000D02*
D03*
X25373000D02*
D03*
X25626999Y15624001D02*
D03*
X25373000D02*
D03*
X25626999Y15370000D02*
D03*
X25373000D02*
D03*
X25626999Y15116000D02*
D03*
X25373000D02*
D03*
X25626999Y16132001D02*
D03*
X25373000D02*
D03*
X25626999Y16386000D02*
D03*
X25373000D02*
D03*
X25626999Y16639999D02*
D03*
X25373000D02*
D03*
X25626999Y16894000D02*
D03*
X25373000D02*
D03*
X25626999Y12576000D02*
D03*
X25373000D02*
D03*
X25626999Y12322000D02*
D03*
X25373000D02*
D03*
Y11560000D02*
D03*
Y12068000D02*
D03*
X25626999D02*
D03*
Y11814000D02*
D03*
X25373000D02*
D03*
X25626999Y11560000D02*
D03*
Y11306000D02*
D03*
X25373000D02*
D03*
X25626999Y11052000D02*
D03*
X25373000D02*
D03*
Y12830000D02*
D03*
X25626999D02*
D03*
X25373000Y13084001D02*
D03*
X25626999D02*
D03*
X25373000Y13338000D02*
D03*
X25626999D02*
D03*
Y13592001D02*
D03*
X25373000Y13846001D02*
D03*
X25626999D02*
D03*
Y14100002D02*
D03*
X25373000D02*
D03*
Y13592001D02*
D03*
Y14354002D02*
D03*
X25626999D02*
D03*
X25373000Y14608002D02*
D03*
X25626999D02*
D03*
Y14862003D02*
D03*
X25373000Y17148000D02*
D03*
X25626999D02*
D03*
X25373000Y14862003D02*
D03*
D19*
X46934601Y10156650D02*
D03*
Y18043350D02*
D03*
X8352000Y18597000D02*
D03*
Y9596995D02*
D03*
X25474600Y10156650D02*
D03*
Y18043350D02*
D03*
X36800000Y18597000D02*
D03*
Y9596995D02*
D03*
X32735999Y18597000D02*
D03*
Y9596995D02*
D03*
X28672000Y18597000D02*
D03*
Y9596995D02*
D03*
X20544000Y18597000D02*
D03*
Y9596995D02*
D03*
X16480000Y18597000D02*
D03*
Y9596995D02*
D03*
X12416000Y18597000D02*
D03*
Y9596995D02*
D03*
D20*
X8352000Y7971994D02*
D03*
X12416002D02*
D03*
X16480003D02*
D03*
X20544006D02*
D03*
X24608009D02*
D03*
X28672012D02*
D03*
X32736014D02*
D03*
X36800015D02*
D03*
X41880002D02*
D03*
X46960022D02*
D03*
X49500000D02*
D03*
X36800012Y20222002D02*
D03*
X8352000D02*
D03*
X12416002D02*
D03*
X16480003D02*
D03*
X20544006D02*
D03*
X24608009D02*
D03*
X28672012D02*
D03*
X32736014D02*
D03*
X41880002D02*
D03*
X46960022D02*
D03*
X49500000D02*
D03*
D21*
X45262799Y10541000D02*
D03*
D22*
X44043600Y10807700D02*
D03*
Y10172700D02*
D03*
Y12522200D02*
D03*
Y13157201D02*
D03*
D23*
X8128000Y11938000D02*
D03*
Y11684000D02*
D03*
Y11430000D02*
D03*
Y11176000D02*
D03*
Y10922000D02*
D03*
Y10668000D02*
D03*
Y10414000D02*
D03*
Y10160000D02*
D03*
Y13970000D02*
D03*
Y13716000D02*
D03*
Y13462000D02*
D03*
Y13208000D02*
D03*
Y12953999D02*
D03*
Y12700000D02*
D03*
Y12446000D02*
D03*
Y12192000D02*
D03*
Y16002000D02*
D03*
Y15748000D02*
D03*
Y15494000D02*
D03*
Y15239999D02*
D03*
Y14986000D02*
D03*
Y14732001D02*
D03*
Y14478000D02*
D03*
Y14224001D02*
D03*
Y16256000D02*
D03*
Y16510001D02*
D03*
Y16764000D02*
D03*
Y17017999D02*
D03*
Y17272000D02*
D03*
Y17525999D02*
D03*
Y17780000D02*
D03*
Y18034000D02*
D03*
X8636000D02*
D03*
Y17780000D02*
D03*
Y17525999D02*
D03*
Y17272000D02*
D03*
Y17017999D02*
D03*
Y16764000D02*
D03*
Y16510001D02*
D03*
Y16256000D02*
D03*
Y14224001D02*
D03*
Y14478000D02*
D03*
Y14732001D02*
D03*
Y14986000D02*
D03*
Y15239999D02*
D03*
Y15494000D02*
D03*
Y15748000D02*
D03*
Y16002000D02*
D03*
Y12192000D02*
D03*
Y12446000D02*
D03*
Y12700000D02*
D03*
Y12953999D02*
D03*
Y13208000D02*
D03*
Y13462000D02*
D03*
Y13716000D02*
D03*
Y13970000D02*
D03*
Y10160000D02*
D03*
Y10414000D02*
D03*
Y10668000D02*
D03*
Y10922000D02*
D03*
Y11176000D02*
D03*
Y11430000D02*
D03*
Y11684000D02*
D03*
Y11938000D02*
D03*
X36576001D02*
D03*
Y11684000D02*
D03*
Y11430000D02*
D03*
Y11176000D02*
D03*
Y10922000D02*
D03*
Y10668000D02*
D03*
Y10414000D02*
D03*
Y10160000D02*
D03*
Y13970000D02*
D03*
Y13716000D02*
D03*
Y13462000D02*
D03*
Y13208000D02*
D03*
Y12953999D02*
D03*
Y12700000D02*
D03*
Y12446000D02*
D03*
Y12192000D02*
D03*
Y16002000D02*
D03*
Y15748000D02*
D03*
Y15494000D02*
D03*
Y15239999D02*
D03*
Y14986000D02*
D03*
Y14732001D02*
D03*
Y14478000D02*
D03*
Y14224001D02*
D03*
Y16256000D02*
D03*
Y16510001D02*
D03*
Y16764000D02*
D03*
Y17017999D02*
D03*
Y17272000D02*
D03*
Y17525999D02*
D03*
Y17780000D02*
D03*
Y18034000D02*
D03*
X37084000D02*
D03*
Y17780000D02*
D03*
Y17525999D02*
D03*
Y17272000D02*
D03*
Y17017999D02*
D03*
Y16764000D02*
D03*
Y16510001D02*
D03*
Y16256000D02*
D03*
Y14224001D02*
D03*
Y14478000D02*
D03*
Y14732001D02*
D03*
Y14986000D02*
D03*
Y15239999D02*
D03*
Y15494000D02*
D03*
Y15748000D02*
D03*
Y16002000D02*
D03*
Y12192000D02*
D03*
Y12446000D02*
D03*
Y12700000D02*
D03*
Y12953999D02*
D03*
Y13208000D02*
D03*
Y13462000D02*
D03*
Y13716000D02*
D03*
Y13970000D02*
D03*
Y10160000D02*
D03*
Y10414000D02*
D03*
Y10668000D02*
D03*
Y10922000D02*
D03*
Y11176000D02*
D03*
Y11430000D02*
D03*
Y11684000D02*
D03*
Y11938000D02*
D03*
X32512000D02*
D03*
Y11684000D02*
D03*
Y11430000D02*
D03*
Y11176000D02*
D03*
Y10922000D02*
D03*
Y10668000D02*
D03*
Y10414000D02*
D03*
Y10160000D02*
D03*
Y13970000D02*
D03*
Y13716000D02*
D03*
Y13462000D02*
D03*
Y13208000D02*
D03*
Y12953999D02*
D03*
Y12700000D02*
D03*
Y12446000D02*
D03*
Y12192000D02*
D03*
Y16002000D02*
D03*
Y15748000D02*
D03*
Y15494000D02*
D03*
Y15239999D02*
D03*
Y14986000D02*
D03*
Y14732001D02*
D03*
Y14478000D02*
D03*
Y14224001D02*
D03*
Y16256000D02*
D03*
Y16510001D02*
D03*
Y16764000D02*
D03*
Y17017999D02*
D03*
Y17272000D02*
D03*
Y17525999D02*
D03*
Y17780000D02*
D03*
Y18034000D02*
D03*
X33020001D02*
D03*
Y17780000D02*
D03*
Y17525999D02*
D03*
Y17272000D02*
D03*
Y17017999D02*
D03*
Y16764000D02*
D03*
Y16510001D02*
D03*
Y16256000D02*
D03*
Y14224001D02*
D03*
Y14478000D02*
D03*
Y14732001D02*
D03*
Y14986000D02*
D03*
Y15239999D02*
D03*
Y15494000D02*
D03*
Y15748000D02*
D03*
Y16002000D02*
D03*
Y12192000D02*
D03*
Y12446000D02*
D03*
Y12700000D02*
D03*
Y12953999D02*
D03*
Y13208000D02*
D03*
Y13462000D02*
D03*
Y13716000D02*
D03*
Y13970000D02*
D03*
Y10160000D02*
D03*
Y10414000D02*
D03*
Y10668000D02*
D03*
Y10922000D02*
D03*
Y11176000D02*
D03*
Y11430000D02*
D03*
Y11684000D02*
D03*
Y11938000D02*
D03*
X28448001D02*
D03*
Y11684000D02*
D03*
Y11430000D02*
D03*
Y11176000D02*
D03*
Y10922000D02*
D03*
Y10668000D02*
D03*
Y10414000D02*
D03*
Y10160000D02*
D03*
Y13970000D02*
D03*
Y13716000D02*
D03*
Y13462000D02*
D03*
Y13208000D02*
D03*
Y12953999D02*
D03*
Y12700000D02*
D03*
Y12446000D02*
D03*
Y12192000D02*
D03*
Y16002000D02*
D03*
Y15748000D02*
D03*
Y15494000D02*
D03*
Y15239999D02*
D03*
Y14986000D02*
D03*
Y14732001D02*
D03*
Y14478000D02*
D03*
Y14224001D02*
D03*
Y16256000D02*
D03*
Y16510001D02*
D03*
Y16764000D02*
D03*
Y17017999D02*
D03*
Y17272000D02*
D03*
Y17525999D02*
D03*
Y17780000D02*
D03*
Y18034000D02*
D03*
X28956000D02*
D03*
Y17780000D02*
D03*
Y17525999D02*
D03*
Y17272000D02*
D03*
Y17017999D02*
D03*
Y16764000D02*
D03*
Y16510001D02*
D03*
Y16256000D02*
D03*
Y14224001D02*
D03*
Y14478000D02*
D03*
Y14732001D02*
D03*
Y14986000D02*
D03*
Y15239999D02*
D03*
Y15494000D02*
D03*
Y15748000D02*
D03*
Y16002000D02*
D03*
Y12192000D02*
D03*
Y12446000D02*
D03*
Y12700000D02*
D03*
Y12953999D02*
D03*
Y13208000D02*
D03*
Y13462000D02*
D03*
Y13716000D02*
D03*
Y13970000D02*
D03*
Y10160000D02*
D03*
Y10414000D02*
D03*
Y10668000D02*
D03*
Y10922000D02*
D03*
Y11176000D02*
D03*
Y11430000D02*
D03*
Y11684000D02*
D03*
Y11938000D02*
D03*
X20320000D02*
D03*
Y11684000D02*
D03*
Y11430000D02*
D03*
Y11176000D02*
D03*
Y10922000D02*
D03*
Y10668000D02*
D03*
Y10414000D02*
D03*
Y10160000D02*
D03*
Y13970000D02*
D03*
Y13716000D02*
D03*
Y13462000D02*
D03*
Y13208000D02*
D03*
Y12953999D02*
D03*
Y12700000D02*
D03*
Y12446000D02*
D03*
Y12192000D02*
D03*
Y16002000D02*
D03*
Y15748000D02*
D03*
Y15494000D02*
D03*
Y15239999D02*
D03*
Y14986000D02*
D03*
Y14732001D02*
D03*
Y14478000D02*
D03*
Y14224001D02*
D03*
Y16256000D02*
D03*
Y16510001D02*
D03*
Y16764000D02*
D03*
Y17017999D02*
D03*
Y17272000D02*
D03*
Y17525999D02*
D03*
Y17780000D02*
D03*
Y18034000D02*
D03*
X20828000D02*
D03*
Y17780000D02*
D03*
Y17525999D02*
D03*
Y17272000D02*
D03*
Y17017999D02*
D03*
Y16764000D02*
D03*
Y16510001D02*
D03*
Y16256000D02*
D03*
Y14224001D02*
D03*
Y14478000D02*
D03*
Y14732001D02*
D03*
Y14986000D02*
D03*
Y15239999D02*
D03*
Y15494000D02*
D03*
Y15748000D02*
D03*
Y16002000D02*
D03*
Y12192000D02*
D03*
Y12446000D02*
D03*
Y12700000D02*
D03*
Y12953999D02*
D03*
Y13208000D02*
D03*
Y13462000D02*
D03*
Y13716000D02*
D03*
Y13970000D02*
D03*
Y10160000D02*
D03*
Y10414000D02*
D03*
Y10668000D02*
D03*
Y10922000D02*
D03*
Y11176000D02*
D03*
Y11430000D02*
D03*
Y11684000D02*
D03*
Y11938000D02*
D03*
X16256000D02*
D03*
Y11684000D02*
D03*
Y11430000D02*
D03*
Y11176000D02*
D03*
Y10922000D02*
D03*
Y10668000D02*
D03*
Y10414000D02*
D03*
Y10160000D02*
D03*
Y13970000D02*
D03*
Y13716000D02*
D03*
Y13462000D02*
D03*
Y13208000D02*
D03*
Y12953999D02*
D03*
Y12700000D02*
D03*
Y12446000D02*
D03*
Y12192000D02*
D03*
Y16002000D02*
D03*
Y15748000D02*
D03*
Y15494000D02*
D03*
Y15239999D02*
D03*
Y14986000D02*
D03*
Y14732001D02*
D03*
Y14478000D02*
D03*
Y14224001D02*
D03*
Y16256000D02*
D03*
Y16510001D02*
D03*
Y16764000D02*
D03*
Y17017999D02*
D03*
Y17272000D02*
D03*
Y17525999D02*
D03*
Y17780000D02*
D03*
Y18034000D02*
D03*
X16764000D02*
D03*
Y17780000D02*
D03*
Y17525999D02*
D03*
Y17272000D02*
D03*
Y17017999D02*
D03*
Y16764000D02*
D03*
Y16510001D02*
D03*
Y16256000D02*
D03*
Y14224001D02*
D03*
Y14478000D02*
D03*
Y14732001D02*
D03*
Y14986000D02*
D03*
Y15239999D02*
D03*
Y15494000D02*
D03*
Y15748000D02*
D03*
Y16002000D02*
D03*
Y12192000D02*
D03*
Y12446000D02*
D03*
Y12700000D02*
D03*
Y12953999D02*
D03*
Y13208000D02*
D03*
Y13462000D02*
D03*
Y13716000D02*
D03*
Y13970000D02*
D03*
Y10160000D02*
D03*
Y10414000D02*
D03*
Y10668000D02*
D03*
Y10922000D02*
D03*
Y11176000D02*
D03*
Y11430000D02*
D03*
Y11684000D02*
D03*
Y11938000D02*
D03*
X12192000D02*
D03*
Y11684000D02*
D03*
Y11430000D02*
D03*
Y11176000D02*
D03*
Y10922000D02*
D03*
Y10668000D02*
D03*
Y10414000D02*
D03*
Y10160000D02*
D03*
Y13970000D02*
D03*
Y13716000D02*
D03*
Y13462000D02*
D03*
Y13208000D02*
D03*
Y12953999D02*
D03*
Y12700000D02*
D03*
Y12446000D02*
D03*
Y12192000D02*
D03*
Y16002000D02*
D03*
Y15748000D02*
D03*
Y15494000D02*
D03*
Y15239999D02*
D03*
Y14986000D02*
D03*
Y14732001D02*
D03*
Y14478000D02*
D03*
Y14224001D02*
D03*
Y16256000D02*
D03*
Y16510001D02*
D03*
Y16764000D02*
D03*
Y17017999D02*
D03*
Y17272000D02*
D03*
Y17525999D02*
D03*
Y17780000D02*
D03*
Y18034000D02*
D03*
X12700000D02*
D03*
Y17780000D02*
D03*
Y17525999D02*
D03*
Y17272000D02*
D03*
Y17017999D02*
D03*
Y16764000D02*
D03*
Y16510001D02*
D03*
Y16256000D02*
D03*
Y14224001D02*
D03*
Y14478000D02*
D03*
Y14732001D02*
D03*
Y14986000D02*
D03*
Y15239999D02*
D03*
Y15494000D02*
D03*
Y15748000D02*
D03*
Y16002000D02*
D03*
Y12192000D02*
D03*
Y12446000D02*
D03*
Y12700000D02*
D03*
Y12953999D02*
D03*
Y13208000D02*
D03*
Y13462000D02*
D03*
Y13716000D02*
D03*
Y13970000D02*
D03*
Y10160000D02*
D03*
Y10414000D02*
D03*
Y10668000D02*
D03*
Y10922000D02*
D03*
Y11176000D02*
D03*
Y11430000D02*
D03*
Y11684000D02*
D03*
Y11938000D02*
D03*
X40640018Y11938000D02*
D03*
Y11684000D02*
D03*
Y11430000D02*
D03*
Y11176000D02*
D03*
Y10922000D02*
D03*
Y10668000D02*
D03*
Y10414000D02*
D03*
Y10160000D02*
D03*
Y13970000D02*
D03*
Y13716000D02*
D03*
Y13462000D02*
D03*
Y13208000D02*
D03*
Y12953999D02*
D03*
Y12700000D02*
D03*
Y12446000D02*
D03*
Y12192000D02*
D03*
Y16002000D02*
D03*
Y15748000D02*
D03*
Y15494000D02*
D03*
Y15239999D02*
D03*
Y14986000D02*
D03*
Y14732001D02*
D03*
Y14478000D02*
D03*
Y14224001D02*
D03*
Y16256000D02*
D03*
Y16510001D02*
D03*
Y16764000D02*
D03*
Y17017999D02*
D03*
Y17272000D02*
D03*
Y17525999D02*
D03*
Y17780000D02*
D03*
Y18034000D02*
D03*
X41148019D02*
D03*
Y17780000D02*
D03*
Y17525999D02*
D03*
Y17272000D02*
D03*
Y17017999D02*
D03*
Y16764000D02*
D03*
Y16510001D02*
D03*
Y16256000D02*
D03*
Y14224001D02*
D03*
Y14478000D02*
D03*
Y14732001D02*
D03*
Y14986000D02*
D03*
Y15239999D02*
D03*
Y15494000D02*
D03*
Y15748000D02*
D03*
Y16002000D02*
D03*
Y12192000D02*
D03*
Y12446000D02*
D03*
Y12700000D02*
D03*
Y12953999D02*
D03*
Y13208000D02*
D03*
Y13462000D02*
D03*
Y13716000D02*
D03*
Y13970000D02*
D03*
Y10160000D02*
D03*
Y10414000D02*
D03*
Y10668000D02*
D03*
Y10922000D02*
D03*
Y11176000D02*
D03*
Y11430000D02*
D03*
Y11684000D02*
D03*
Y11938000D02*
D03*
D24*
X40864017Y18597000D02*
D03*
Y9596995D02*
D03*
D25*
X42062399Y15227299D02*
D03*
D31*
X28932748Y20203751D02*
D03*
Y7980005D02*
D03*
%TF.MD5,3f06311f773017eb3a3e6593112808a2*%
M02*
