%TF.GenerationSoftware,Altium Limited,Altium Designer,19.1.5 (86)*%
G04 Layer_Color=16711935*
%FSLAX45Y45*%
%MOMM*%
%TF.FileFunction,Other,Corners*%
%TF.Part,Single*%
G01*
G75*
%TA.AperFunction,NonConductor*%
%ADD31C,0.25400*%
D31*
X0Y-499999D02*
Y0D01*
X-500004D02*
X0D01*
X16000000Y-500004D02*
Y0D01*
X16500000D01*
X16000000Y10000005D02*
X16500000D01*
X16000000D02*
Y10500004D01*
X0Y10000005D02*
Y10500004D01*
X-499999Y10000005D02*
X0D01*
%TF.MD5,4344d4eba8755bb66e7fbb59e5a98058*%
M02*
