%TF.GenerationSoftware,Altium Limited,Altium Designer,19.1.5 (86)*%
G04 Layer_Color=0*
%FSLAX45Y45*%
%MOMM*%
%TF.FileFunction,Profile,NP*%
%TF.Part,Single*%
G01*
G75*
%TA.AperFunction,Profile*%
%ADD44C,0.02540*%
D44*
X0Y0D02*
X16000000D01*
Y10000005D01*
X0D01*
Y0D01*
%TF.MD5,f366845486d0f8524d9fa3df2925f96a*%
M02*
