%TF.GenerationSoftware,Altium Limited,Altium Designer,19.1.5 (86)*%
G04 Layer_Color=255*
%FSLAX45Y45*%
%MOMM*%
%TF.FileFunction,Pads,Bot*%
%TF.Part,Single*%
G01*
G75*
%TA.AperFunction,ComponentPad*%
%ADD23C,1.70000*%
%ADD24C,1.60000*%
%ADD25C,5.50000*%
%ADD26C,2.00000*%
%TA.AperFunction,ViaPad*%
%ADD28C,4.45000*%
%TA.AperFunction,ComponentPad*%
%ADD30C,5.10000*%
D23*
X692808Y1317003D02*
D03*
X946808D02*
D03*
X438808D02*
D03*
X184808D02*
D03*
X692808Y1583703D02*
D03*
X946808D02*
D03*
X438808D02*
D03*
X184808D02*
D03*
X692808Y1850403D02*
D03*
X946808D02*
D03*
X438808D02*
D03*
X184808D02*
D03*
X692808Y2117103D02*
D03*
X946808D02*
D03*
X438808D02*
D03*
X184808D02*
D03*
X692808Y2383803D02*
D03*
X946808D02*
D03*
X438808D02*
D03*
X184808D02*
D03*
X692808Y2650503D02*
D03*
X946808D02*
D03*
X438808D02*
D03*
X184808D02*
D03*
X14962007Y8937005D02*
D03*
Y8683005D02*
D03*
Y8429005D02*
D03*
Y8175005D02*
D03*
Y7921005D02*
D03*
Y7667005D02*
D03*
Y7413005D02*
D03*
Y7159005D02*
D03*
Y5127005D02*
D03*
Y5381005D02*
D03*
Y5635005D02*
D03*
Y5889005D02*
D03*
Y6143005D02*
D03*
Y6397005D02*
D03*
Y6651005D02*
D03*
Y6905005D02*
D03*
Y3095005D02*
D03*
Y3349005D02*
D03*
Y3603005D02*
D03*
Y3857005D02*
D03*
Y4111005D02*
D03*
Y4365005D02*
D03*
Y4619005D02*
D03*
Y4873005D02*
D03*
Y1063005D02*
D03*
Y1317005D02*
D03*
Y1571005D02*
D03*
Y1825005D02*
D03*
Y2079005D02*
D03*
Y2333005D02*
D03*
Y2587005D02*
D03*
Y2841005D02*
D03*
X15470007D02*
D03*
Y2587005D02*
D03*
Y2333005D02*
D03*
Y2079005D02*
D03*
Y1825005D02*
D03*
Y1571005D02*
D03*
Y1317005D02*
D03*
Y1063005D02*
D03*
Y4873005D02*
D03*
Y4619005D02*
D03*
Y4365005D02*
D03*
Y4111005D02*
D03*
Y3857005D02*
D03*
Y3603005D02*
D03*
Y3349005D02*
D03*
Y3095005D02*
D03*
Y6905005D02*
D03*
Y6651005D02*
D03*
Y6397005D02*
D03*
Y6143005D02*
D03*
Y5889005D02*
D03*
Y5635005D02*
D03*
Y5381005D02*
D03*
Y5127005D02*
D03*
Y7159005D02*
D03*
Y7413005D02*
D03*
Y7667005D02*
D03*
Y7921005D02*
D03*
Y8175005D02*
D03*
Y8429005D02*
D03*
Y8683005D02*
D03*
Y8937005D02*
D03*
D24*
X1150008Y5993002D02*
D03*
Y7932004D02*
D03*
Y7655003D02*
D03*
Y7378003D02*
D03*
Y7101003D02*
D03*
Y6824003D02*
D03*
Y5716002D02*
D03*
Y6270003D02*
D03*
Y6547003D02*
D03*
Y5439002D02*
D03*
Y5162002D02*
D03*
Y4885002D02*
D03*
Y4608002D02*
D03*
X896008Y7795003D02*
D03*
Y7518003D02*
D03*
Y7241003D02*
D03*
Y6964003D02*
D03*
Y6687003D02*
D03*
Y6410003D02*
D03*
Y6133003D02*
D03*
Y5856003D02*
D03*
Y5579002D02*
D03*
Y5302002D02*
D03*
Y5025002D02*
D03*
Y4748002D02*
D03*
D25*
X1023008Y8620004D02*
D03*
Y3920001D02*
D03*
D26*
X13736827Y2588644D02*
D03*
X14304773Y2592956D02*
D03*
X13736827Y1572644D02*
D03*
X14304773Y1576956D02*
D03*
D28*
X357008Y555003D02*
D03*
Y9445003D02*
D03*
D30*
X15724007Y555005D02*
D03*
Y9445005D02*
D03*
%TF.MD5,d22d836e8ffdef31ac67fb3b209598e7*%
M02*
