%TF.GenerationSoftware,Altium Limited,Altium Designer,19.1.5 (86)*%
G04 Layer_Color=16711935*
%FSLAX45Y45*%
%MOMM*%
%TF.FileFunction,Other,Mechanical_1*%
%TF.Part,Single*%
G01*
G75*
%TA.AperFunction,NonConductor*%
%ADD43C,1.27000*%
D43*
X0Y0D02*
Y10000005D01*
X16000000D01*
Y0D02*
Y10000005D01*
X0Y0D02*
X16000000D01*
%TF.MD5,dc5da6167f9ab5c97635d547ff05ca57*%
M02*
