Altium Designer Pick and Place Locations
G:\Departments\PH\Groups\TA1\Atlas_trt\Xavier\Xavi\LHCb\VELO-Safety-System\PCB\velo-tntc-v2\Project Outputs for EDA-0xxxx-V1-0_project\Pick Place for VELO TNTC V2.txt

========================================================================================================================
File Design Information:

Date:       24/02/21
Time:       08:54
Revision:   1e9113b804fb374566fba8a708be8511a04557eb
Variant:    No variations
Units used: mil

Designator Comment            Layer    Footprint               Center-X(mil) Center-Y(mil) Rotation Description                                     
R63        300                TopLayer RESC3216X65N            4737.759mil   1693.505mil   0        "Resistor - 1%"                                 
R62        300                TopLayer RESC3216X65N            4737.759mil   1793.505mil   0        "Resistor - 1%"                                 
R61        300                TopLayer RESC3216X65N            4737.759mil   1893.505mil   0        "Resistor - 1%"                                 
R60        300                TopLayer RESC3216X65N            4737.759mil   1993.505mil   0        "Resistor - 1%"                                 
LD313      Green/Green        TopLayer LED_DIALIGHT_571-0122F  222.759mil    518.505mil    0        "LED x2 Green 1C2A-BOT_3C4A-TOP"                
LD311      Green/Green        TopLayer LED_DIALIGHT_571-0122F  222.759mil    623.505mil    0        "LED x2 Green 1C2A-BOT_3C4A-TOP"                
LD213      Green/Green        TopLayer LED_DIALIGHT_571-0122F  222.759mil    728.505mil    0        "LED x2 Green 1C2A-BOT_3C4A-TOP"                
LD211      Green/Green        TopLayer LED_DIALIGHT_571-0122F  222.759mil    833.505mil    0        "LED x2 Green 1C2A-BOT_3C4A-TOP"                
LD113      Green/Green        TopLayer LED_DIALIGHT_571-0122F  222.759mil    938.505mil    0        "LED x2 Green 1C2A-BOT_3C4A-TOP"                
LD111      Green/Green        TopLayer LED_DIALIGHT_571-0122F  222.759mil    1043.505mil   0        "LED x2 Green 1C2A-BOT_3C4A-TOP"                
FH2        ""                 TopLayer FUSH_LITTELFUSE_281005  5520.000mil   1020.000mil   270      "Fuse Holder"                                   
F2         2A-125V            TopLayer FUSE_SCHURTER_MSF125_v  -3047.241mil  -3031.495mil  0        Fuse                                            
J1         D-Sub              TopLayer AMPHENOL_L717DFB25P1ATN 402.759mil    2468.505mil   90       "Connector D-sub 25 Male"                       
RN32       1k                 TopLayer SOIC127P760X215-16N     3672.759mil   1968.505mil   90       "DIL16 Resistor Network 8 Isolated Resistor 2%" 
RN30       10k                TopLayer SOIC127P760X215-16N     2352.759mil   1968.505mil   270      "DIL16 Resistor Network 8 Isolated Resistor 2%" 
RN20       10k                TopLayer SOIC127P760X215-16N     2352.759mil   2468.505mil   270      "DIL16 Resistor Network 8 Isolated Resistor 2%" 
RN12       1k                 TopLayer SOIC127P760X215-16N     3672.759mil   2983.505mil   90       "DIL16 Resistor Network 8 Isolated Resistor 2%" 
RN10       10k                TopLayer SOIC127P760X215-16N     2352.759mil   2968.505mil   270      "DIL16 Resistor Network 8 Isolated Resistor 2%" 
RN2        1k                 TopLayer SOIC127P760X215-16N     1412.759mil   3608.505mil   90       "DIL16 Resistor Network 8 Isolated Resistor 2%" 
RN1        1k                 TopLayer SOIC127P760X215-16N     917.759mil    3608.505mil   90       "DIL16 Resistor Network 8 Isolated Resistor 2%" 
R314       300                TopLayer RESC3216X65N            1482.759mil   1213.505mil   90       "Resistor - 1%"                                 
R313       300                TopLayer RESC3216X65N            1397.759mil   1213.505mil   90       "Resistor - 1%"                                 
R312       300                TopLayer RESC3216X65N            1312.759mil   1213.505mil   90       "Resistor - 1%"                                 
R311       300                TopLayer RESC3216X65N            1227.759mil   1213.505mil   90       "Resistor - 1%"                                 
R214       300                TopLayer RESC3216X65N            1142.759mil   1213.505mil   90       "Resistor - 1%"                                 
R213       300                TopLayer RESC3216X65N            1057.759mil   1213.505mil   90       "Resistor - 1%"                                 
R211       300                TopLayer RESC3216X65N            887.759mil    1213.505mil   90       "Resistor - 1%"                                 
R114       300                TopLayer RESC3216X65N            802.759mil    1213.505mil   90       "Resistor - 1%"                                 
R113       300                TopLayer RESC3216X65N            717.759mil    1213.505mil   90       "Resistor - 1%"                                 
R112       300                TopLayer RESC3216X65N            632.759mil    1213.505mil   90       "Resistor - 1%"                                 
R111       300                TopLayer RESC3216X65N            547.759mil    1213.505mil   90       "Resistor - 1%"                                 
R212       300                TopLayer RESC3216X65N            972.759mil    1213.505mil   90       "Resistor - 1%"                                 
R67        12k                TopLayer RESC3216X65N            5357.759mil   1693.505mil   0        "Resistor - 1%"                                 
R66        12k                TopLayer RESC3216X65N            5357.759mil   1793.505mil   0        "Resistor - 1%"                                 
R65        12k                TopLayer RESC3216X65N            5357.759mil   1893.505mil   0        "Resistor - 1%"                                 
R64        12k                TopLayer RESC3216X65N            5357.759mil   1993.505mil   0        "Resistor - 1%"                                 
R57        12k                TopLayer RESC3216X65N            5357.759mil   2443.505mil   0        "Resistor - 1%"                                 
R56        12k                TopLayer RESC3216X65N            5357.759mil   2543.505mil   0        "Resistor - 1%"                                 
R55        12k                TopLayer RESC3216X65N            5357.759mil   2643.505mil   0        "Resistor - 1%"                                 
R54        12k                TopLayer RESC3216X65N            5357.759mil   2743.505mil   0        "Resistor - 1%"                                 
R53        300                TopLayer RESC3216X65N            4737.759mil   2443.505mil   0        "Resistor - 1%"                                 
R52        300                TopLayer RESC3216X65N            4737.759mil   2538.505mil   0        "Resistor - 1%"                                 
R51        300                TopLayer RESC3216X65N            4737.759mil   2643.505mil   0        "Resistor - 1%"                                 
R50        300                TopLayer RESC3216X65N            4737.759mil   2743.505mil   0        "Resistor - 1%"                                 
R47        12k                TopLayer RESC3216X65N            5357.759mil   3203.505mil   0        "Resistor - 1%"                                 
R46        12k                TopLayer RESC3216X65N            5357.759mil   3303.505mil   0        "Resistor - 1%"                                 
R45        12k                TopLayer RESC3216X65N            5357.759mil   3403.505mil   0        "Resistor - 1%"                                 
R44        12k                TopLayer RESC3216X65N            5357.759mil   3503.505mil   0        "Resistor - 1%"                                 
R43        300                TopLayer RESC3216X65N            4737.759mil   3203.505mil   0        "Resistor - 1%"                                 
R42        300                TopLayer RESC3216X65N            4737.759mil   3303.505mil   0        "Resistor - 1%"                                 
R41        300                TopLayer RESC3216X65N            4737.759mil   3403.505mil   0        "Resistor - 1%"                                 
R40        300                TopLayer RESC3216X65N            4737.759mil   3503.505mil   0        "Resistor - 1%"                                 
R38        1k1                TopLayer RESC1608X55N            1597.759mil   1638.505mil   0        "Resistor - 1%"                                 
R37        1k1                TopLayer RESC1608X55N            1597.759mil   1768.505mil   0        "Resistor - 1%"                                 
R36        1k1                TopLayer RESC1608X55N            1597.759mil   1898.505mil   0        "Resistor - 1%"                                 
R35        1k1                TopLayer RESC1608X55N            1597.759mil   2028.505mil   0        "Resistor - 1%"                                 
R28        1k1                TopLayer RESC1608X55N            1597.759mil   2183.505mil   0        "Resistor - 1%"                                 
R27        1k1                TopLayer RESC1608X55N            1597.759mil   2313.505mil   0        "Resistor - 1%"                                 
R26        1k1                TopLayer RESC1608X55N            1597.759mil   2443.505mil   0        "Resistor - 1%"                                 
R25        1k1                TopLayer RESC1608X55N            1597.759mil   2573.505mil   0        "Resistor - 1%"                                 
R18        1k1                TopLayer RESC1608X55N            1597.759mil   2733.505mil   0        "Resistor - 1%"                                 
R17        1k1                TopLayer RESC1608X55N            1597.759mil   2863.505mil   0        "Resistor - 1%"                                 
R16        1k1                TopLayer RESC1608X55N            1597.759mil   2993.505mil   0        "Resistor - 1%"                                 
R15        1k1                TopLayer RESC1608X55N            1597.759mil   3123.505mil   0        "Resistor - 1%"                                 
IC60       SFH6916            TopLayer SOIC127P686X216-16N     5052.759mil   1818.505mil   0        "Quad Optocoupler"                              
IC50       SFH6916            TopLayer SOIC127P686X216-16N     5052.759mil   2568.505mil   0        "Quad Optocoupler"                              
IC40       SFH6916            TopLayer SOIC127P686X216-16N     5052.838mil   3327.505mil   0        "Quad Optocoupler"                              
IC31       TBD62083AFNG       TopLayer SOP65P640X155-18N       4252.759mil   2318.505mil   0        "8 Channel Sink Type DMOS Transistor Array"     
IC30       LM339AD            TopLayer SOIC127P600X175-14N     2952.759mil   1968.505mil   270      "Quad Operational Amplifier"                    
IC20       LM339AD            TopLayer SOIC127P600X175-14N     2952.759mil   2468.505mil   270      "Quad Operational Amplifier"                    
IC11       TBD62083AFNG       TopLayer SOP65P640X155-18N       4252.759mil   3348.505mil   0        "8 Channel Sink Type DMOS Transistor Array"     
IC10       LM339AD            TopLayer SOIC127P600X175-14N     2952.759mil   2968.505mil   270      "Quad Operational Amplifier"                    
FH1        ""                 TopLayer FUSH_LITTELFUSE_281005  5520.000mil   620.000mil    270      "Fuse Holder"                                   
F1         2A-125V            TopLayer FUSE_SCHURTER_MSF125_v  -3047.241mil  -3031.495mil  0        Fuse                                            
C38        4.7uF              TopLayer CAPC2012X135N           1592.759mil   1703.505mil   0        "Non-polarised capacitor"                       
C37        4.7uF              TopLayer CAPC2012X135N           1592.759mil   1833.505mil   0        "Non-polarised capacitor"                       
C36        4.7uF              TopLayer CAPC2012X135N           1592.759mil   1963.505mil   0        "Non-polarised capacitor"                       
C35        4.7uF              TopLayer CAPC2012X135N           1592.759mil   2093.505mil   0        "Non-polarised capacitor"                       
C30        100nF              TopLayer CAPC1608X87N            3002.759mil   2178.505mil   270      "Non-polarised capacitor"                       
C28        4.7uF              TopLayer CAPC2012X135N           1592.759mil   2248.505mil   0        "Non-polarised capacitor"                       
C27        4.7uF              TopLayer CAPC2012X135N           1592.759mil   2378.505mil   0        "Non-polarised capacitor"                       
C26        4.7uF              TopLayer CAPC2012X135N           1592.759mil   2508.505mil   0        "Non-polarised capacitor"                       
C25        4.7uF              TopLayer CAPC2012X135N           1592.326mil   2638.505mil   0        "Non-polarised capacitor"                       
C20        100nF              TopLayer CAPC1608X87N            3002.759mil   2678.505mil   270      "Non-polarised capacitor"                       
C18        4.7uF              TopLayer CAPC2012X135N           1592.759mil   2798.505mil   0        "Non-polarised capacitor"                       
C17        4.7uF              TopLayer CAPC2012X135N           1592.759mil   2928.505mil   0        "Non-polarised capacitor"                       
C16        4.7uF              TopLayer CAPC2012X135N           1592.759mil   3058.505mil   0        "Non-polarised capacitor"                       
C15        4.7uF              TopLayer CAPC2012X135N           1592.759mil   3188.505mil   0        "Non-polarised capacitor"                       
C10        100nF              TopLayer CAPC1608X87N            3002.759mil   3178.505mil   270      "Non-polarised capacitor"                       
J2         "DIN 41612 Type C" TopLayer HARTING_09_03_164_6921  6040.554mil   1968.506mil   0        "Connector 64ac male (2x32)"                    
