%TF.GenerationSoftware,Altium Limited,Altium Designer,19.1.5 (86)*%
G04 Layer_Color=8388736*
%FSLAX45Y45*%
%MOMM*%
%TF.FileFunction,Soldermask,Top*%
%TF.Part,Single*%
G01*
G75*
%TA.AperFunction,SMDPad,CuDef*%
%ADD10R,1.15000X1.80000*%
%ADD11R,1.00000X0.95000*%
%ADD12R,0.60000X1.55000*%
%ADD13R,0.63000X2.00000*%
%ADD14R,1.05000X1.40000*%
%ADD15R,0.90000X1.00000*%
%ADD16R,1.80000X1.15000*%
%ADD17R,1.70000X0.60000*%
%ADD18R,1.45000X0.45000*%
%TA.AperFunction,ComponentPad*%
%ADD23C,1.70000*%
%ADD24C,1.60000*%
%ADD25C,5.50000*%
%ADD26C,2.00000*%
%ADD27C,3.50000*%
%TA.AperFunction,ViaPad*%
%ADD28C,4.45000*%
%ADD29C,1.10000*%
G36*
X1366008Y3560502D02*
X106008D01*
Y4280501D01*
X1366008D01*
Y3560502D01*
D02*
G37*
G36*
Y8260504D02*
X106008D01*
Y8980504D01*
X1366008D01*
Y8260504D01*
D02*
G37*
D10*
X13753708Y8136903D02*
D03*
X13463708D02*
D03*
X13753708Y8390903D02*
D03*
X13463708D02*
D03*
X13753708Y8644903D02*
D03*
X13463708D02*
D03*
X13753708Y8898903D02*
D03*
X13463708D02*
D03*
X12178908Y8136903D02*
D03*
X11888908D02*
D03*
X12178908Y8390903D02*
D03*
X11888908D02*
D03*
X12178908Y8644903D02*
D03*
X11888908D02*
D03*
X12178908Y8898903D02*
D03*
X11888908D02*
D03*
X12178908Y6206503D02*
D03*
X11888908D02*
D03*
X12178908Y6447803D02*
D03*
X11888908D02*
D03*
X12178908Y6714503D02*
D03*
X11888908D02*
D03*
X12178908Y6968503D02*
D03*
X11888908D02*
D03*
X12178908Y4301503D02*
D03*
X11888908D02*
D03*
X12178908Y4555503D02*
D03*
X11888908D02*
D03*
X12178908Y4809503D02*
D03*
X11888908D02*
D03*
X12178908Y5063503D02*
D03*
X11888908D02*
D03*
X13753708Y6206503D02*
D03*
X13463708D02*
D03*
X13753708Y6460503D02*
D03*
X13463708D02*
D03*
X13753708Y6714503D02*
D03*
X13463708D02*
D03*
X13753708Y4301503D02*
D03*
X13463708D02*
D03*
X13753708Y4555503D02*
D03*
X13463708D02*
D03*
X13753708Y4809503D02*
D03*
X13463708D02*
D03*
X13753708Y5063503D02*
D03*
X13463708D02*
D03*
X13753708Y6968503D02*
D03*
X13463708D02*
D03*
D11*
X7627008Y5453403D02*
D03*
Y5613403D02*
D03*
Y6723403D02*
D03*
Y6883403D02*
D03*
Y7993403D02*
D03*
Y8153403D02*
D03*
D12*
X7881008Y5270003D02*
D03*
X7754008D02*
D03*
X7627008D02*
D03*
X7500008D02*
D03*
X7373008D02*
D03*
X7246008D02*
D03*
X7119008D02*
D03*
X7881008Y4730003D02*
D03*
X7754008D02*
D03*
X7627008D02*
D03*
X7500008D02*
D03*
X7373008D02*
D03*
X7246008D02*
D03*
X7119008D02*
D03*
X7881008Y6540003D02*
D03*
X7754008D02*
D03*
X7627008D02*
D03*
X7500008D02*
D03*
X7373008D02*
D03*
X7246008D02*
D03*
X7119008D02*
D03*
X7881008Y6000003D02*
D03*
X7754008D02*
D03*
X7627008D02*
D03*
X7500008D02*
D03*
X7373008D02*
D03*
X7246008D02*
D03*
X7119008D02*
D03*
X7881008Y7810003D02*
D03*
X7754008D02*
D03*
X7627008D02*
D03*
X7500008D02*
D03*
X7373008D02*
D03*
X7246008D02*
D03*
X7119008D02*
D03*
X7881008Y7270003D02*
D03*
X7754008D02*
D03*
X7627008D02*
D03*
X7500008D02*
D03*
X7373008D02*
D03*
X7246008D02*
D03*
X7119008D02*
D03*
D13*
X5531508Y4655003D02*
D03*
X5658508D02*
D03*
X5785508D02*
D03*
X5912508D02*
D03*
X6039508D02*
D03*
X6166508D02*
D03*
X6293508D02*
D03*
X6420508D02*
D03*
X5531508Y5345003D02*
D03*
X5658508D02*
D03*
X5785508D02*
D03*
X5912508D02*
D03*
X6039508D02*
D03*
X6166508D02*
D03*
X6293508D02*
D03*
X6420508D02*
D03*
X3143908Y8820603D02*
D03*
X3270908D02*
D03*
X3397908D02*
D03*
X3524908D02*
D03*
X3651908D02*
D03*
X3778908D02*
D03*
X3905908D02*
D03*
X4032908D02*
D03*
X3143908Y9510603D02*
D03*
X3270908D02*
D03*
X3397908D02*
D03*
X3524908D02*
D03*
X3651908D02*
D03*
X3778908D02*
D03*
X3905908D02*
D03*
X4032908D02*
D03*
X1886608Y8820603D02*
D03*
X2013608D02*
D03*
X2140608D02*
D03*
X2267608D02*
D03*
X2394608D02*
D03*
X2521608D02*
D03*
X2648608D02*
D03*
X2775608D02*
D03*
X1886608Y9510603D02*
D03*
X2013608D02*
D03*
X2140608D02*
D03*
X2267608D02*
D03*
X2394608D02*
D03*
X2521608D02*
D03*
X2648608D02*
D03*
X2775608D02*
D03*
X8884308Y4655003D02*
D03*
X9011308D02*
D03*
X9138308D02*
D03*
X9265308D02*
D03*
X9392308D02*
D03*
X9519308D02*
D03*
X9646308D02*
D03*
X9773308D02*
D03*
X8884308Y5345003D02*
D03*
X9011308D02*
D03*
X9138308D02*
D03*
X9265308D02*
D03*
X9392308D02*
D03*
X9519308D02*
D03*
X9646308D02*
D03*
X9773308D02*
D03*
X6420508Y6615003D02*
D03*
X6293508D02*
D03*
X6166508D02*
D03*
X6039508D02*
D03*
X5912508D02*
D03*
X5785508D02*
D03*
X5658508D02*
D03*
X5531508D02*
D03*
X6420508Y5925003D02*
D03*
X6293508D02*
D03*
X6166508D02*
D03*
X6039508D02*
D03*
X5912508D02*
D03*
X5785508D02*
D03*
X5658508D02*
D03*
X5531508D02*
D03*
X8884308Y7233103D02*
D03*
X9011308D02*
D03*
X9138308D02*
D03*
X9265308D02*
D03*
X9392308D02*
D03*
X9519308D02*
D03*
X9646308D02*
D03*
X9773308D02*
D03*
X8884308Y7923103D02*
D03*
X9011308D02*
D03*
X9138308D02*
D03*
X9265308D02*
D03*
X9392308D02*
D03*
X9519308D02*
D03*
X9646308D02*
D03*
X9773308D02*
D03*
X6420508Y7885003D02*
D03*
X6293508D02*
D03*
X6166508D02*
D03*
X6039508D02*
D03*
X5912508D02*
D03*
X5785508D02*
D03*
X5658508D02*
D03*
X5531508D02*
D03*
X6420508Y7195003D02*
D03*
X6293508D02*
D03*
X6166508D02*
D03*
X6039508D02*
D03*
X5912508D02*
D03*
X5785508D02*
D03*
X5658508D02*
D03*
X5531508D02*
D03*
D14*
X4135608Y4326903D02*
D03*
X3955608D02*
D03*
X4135608Y4987303D02*
D03*
X3955608D02*
D03*
X4135608Y6371603D02*
D03*
X3955608D02*
D03*
X4134508Y6701803D02*
D03*
X3954508D02*
D03*
X4135608Y7768603D02*
D03*
X3955608D02*
D03*
X4135608Y7108203D02*
D03*
X3955608D02*
D03*
X4135608Y5711203D02*
D03*
X3955608D02*
D03*
X4135608Y4657103D02*
D03*
X3955608D02*
D03*
X4135608Y7438403D02*
D03*
X3955608D02*
D03*
X4135608Y6041403D02*
D03*
X3955608D02*
D03*
X4135608Y5317503D02*
D03*
X3955608D02*
D03*
X4135608Y8098803D02*
D03*
X3955608D02*
D03*
D15*
X3978308Y4161803D02*
D03*
X4138308D02*
D03*
X3978308Y4492003D02*
D03*
X4138308D02*
D03*
X3978308Y4822203D02*
D03*
X4138308D02*
D03*
X3978308Y5876303D02*
D03*
X4138308D02*
D03*
X3978308Y6206503D02*
D03*
X4138308D02*
D03*
X3978308Y7603503D02*
D03*
X4138308D02*
D03*
X3978308Y5152403D02*
D03*
X4138308D02*
D03*
X3978308Y5546103D02*
D03*
X4138308D02*
D03*
X3978308Y6536703D02*
D03*
X4138308D02*
D03*
X3978308Y6943103D02*
D03*
X4138308D02*
D03*
X3978308Y7273303D02*
D03*
X4138308D02*
D03*
X3978308Y7933703D02*
D03*
X4138308D02*
D03*
D16*
X3766208Y2937303D02*
D03*
Y3227303D02*
D03*
X3550308Y2937303D02*
D03*
Y3227303D02*
D03*
X3334408Y2937303D02*
D03*
Y3227303D02*
D03*
X3118508Y2937303D02*
D03*
Y3227303D02*
D03*
X2902608Y2937303D02*
D03*
Y3227303D02*
D03*
X2686708Y2937303D02*
D03*
Y3227303D02*
D03*
X2470808Y2937303D02*
D03*
Y3227303D02*
D03*
X2254908Y2937303D02*
D03*
Y3227303D02*
D03*
X2039008Y2937303D02*
D03*
Y3227303D02*
D03*
X1823108Y2937303D02*
D03*
Y3227303D02*
D03*
X1607208Y2937303D02*
D03*
Y3227303D02*
D03*
X1391308Y2937303D02*
D03*
Y3227303D02*
D03*
D17*
X13139207Y8896363D02*
D03*
Y8769363D02*
D03*
Y8642363D02*
D03*
Y8515363D02*
D03*
Y8388363D02*
D03*
Y8261363D02*
D03*
Y8134363D02*
D03*
Y8007363D02*
D03*
X12529208D02*
D03*
Y8134363D02*
D03*
Y8261363D02*
D03*
Y8388363D02*
D03*
Y8515363D02*
D03*
Y8642363D02*
D03*
Y8769363D02*
D03*
Y8896363D02*
D03*
X13139008Y6968503D02*
D03*
Y6841503D02*
D03*
Y6714503D02*
D03*
Y6587503D02*
D03*
Y6460503D02*
D03*
Y6333503D02*
D03*
Y6206503D02*
D03*
Y6079503D02*
D03*
X12529008D02*
D03*
Y6206503D02*
D03*
Y6333503D02*
D03*
Y6460503D02*
D03*
Y6587503D02*
D03*
Y6714503D02*
D03*
Y6841503D02*
D03*
Y6968503D02*
D03*
X13139008Y5063503D02*
D03*
Y4936503D02*
D03*
Y4809503D02*
D03*
Y4682503D02*
D03*
Y4555503D02*
D03*
Y4428503D02*
D03*
Y4301503D02*
D03*
Y4174503D02*
D03*
X12529008D02*
D03*
Y4301503D02*
D03*
Y4428503D02*
D03*
Y4555503D02*
D03*
Y4682503D02*
D03*
Y4809503D02*
D03*
Y4936503D02*
D03*
Y5063503D02*
D03*
D18*
X11097008Y8765203D02*
D03*
Y8700203D02*
D03*
X10507008Y8765203D02*
D03*
Y8700203D02*
D03*
Y8635203D02*
D03*
Y8570203D02*
D03*
Y8505203D02*
D03*
Y8440203D02*
D03*
Y8375203D02*
D03*
Y8310203D02*
D03*
X11097008Y8635203D02*
D03*
Y8570203D02*
D03*
Y8505203D02*
D03*
Y8440203D02*
D03*
Y8375203D02*
D03*
Y8310203D02*
D03*
Y8245203D02*
D03*
X10507008D02*
D03*
X11097008Y6149003D02*
D03*
Y6084003D02*
D03*
X10507008Y6149003D02*
D03*
Y6084003D02*
D03*
Y6019003D02*
D03*
Y5954003D02*
D03*
Y5889003D02*
D03*
Y5824003D02*
D03*
Y5759003D02*
D03*
Y5694003D02*
D03*
X11097008Y6019003D02*
D03*
Y5954003D02*
D03*
Y5889003D02*
D03*
Y5824003D02*
D03*
Y5759003D02*
D03*
Y5694003D02*
D03*
Y5629003D02*
D03*
X10507008D02*
D03*
D23*
X692808Y1317003D02*
D03*
X946808D02*
D03*
X438808D02*
D03*
X184808D02*
D03*
X692808Y1583703D02*
D03*
X946808D02*
D03*
X438808D02*
D03*
X184808D02*
D03*
X692808Y1850403D02*
D03*
X946808D02*
D03*
X438808D02*
D03*
X184808D02*
D03*
X692808Y2117103D02*
D03*
X946808D02*
D03*
X438808D02*
D03*
X184808D02*
D03*
X692808Y2383803D02*
D03*
X946808D02*
D03*
X438808D02*
D03*
X184808D02*
D03*
X692808Y2650503D02*
D03*
X946808D02*
D03*
X438808D02*
D03*
X184808D02*
D03*
X14962007Y8937005D02*
D03*
Y8683005D02*
D03*
Y8429005D02*
D03*
Y8175005D02*
D03*
Y7921005D02*
D03*
Y7667005D02*
D03*
Y7413005D02*
D03*
Y7159005D02*
D03*
Y5127005D02*
D03*
Y5381005D02*
D03*
Y5635005D02*
D03*
Y5889005D02*
D03*
Y6143005D02*
D03*
Y6397005D02*
D03*
Y6651005D02*
D03*
Y6905005D02*
D03*
Y3095005D02*
D03*
Y3349005D02*
D03*
Y3603005D02*
D03*
Y3857005D02*
D03*
Y4111005D02*
D03*
Y4365005D02*
D03*
Y4619005D02*
D03*
Y4873005D02*
D03*
Y1063005D02*
D03*
Y1317005D02*
D03*
Y1571005D02*
D03*
Y1825005D02*
D03*
Y2079005D02*
D03*
Y2333005D02*
D03*
Y2587005D02*
D03*
Y2841005D02*
D03*
X15470007D02*
D03*
Y2587005D02*
D03*
Y2333005D02*
D03*
Y2079005D02*
D03*
Y1825005D02*
D03*
Y1571005D02*
D03*
Y1317005D02*
D03*
Y1063005D02*
D03*
Y4873005D02*
D03*
Y4619005D02*
D03*
Y4365005D02*
D03*
Y4111005D02*
D03*
Y3857005D02*
D03*
Y3603005D02*
D03*
Y3349005D02*
D03*
Y3095005D02*
D03*
Y6905005D02*
D03*
Y6651005D02*
D03*
Y6397005D02*
D03*
Y6143005D02*
D03*
Y5889005D02*
D03*
Y5635005D02*
D03*
Y5381005D02*
D03*
Y5127005D02*
D03*
Y7159005D02*
D03*
Y7413005D02*
D03*
Y7667005D02*
D03*
Y7921005D02*
D03*
Y8175005D02*
D03*
Y8429005D02*
D03*
Y8683005D02*
D03*
Y8937005D02*
D03*
D24*
X1150008Y5993002D02*
D03*
Y7932004D02*
D03*
Y7655003D02*
D03*
Y7378003D02*
D03*
Y7101003D02*
D03*
Y6824003D02*
D03*
Y5716002D02*
D03*
Y6270003D02*
D03*
Y6547003D02*
D03*
Y5439002D02*
D03*
Y5162002D02*
D03*
Y4885002D02*
D03*
Y4608002D02*
D03*
X896008Y7795003D02*
D03*
Y7518003D02*
D03*
Y7241003D02*
D03*
Y6964003D02*
D03*
Y6687003D02*
D03*
Y6410003D02*
D03*
Y6133003D02*
D03*
Y5856003D02*
D03*
Y5579002D02*
D03*
Y5302002D02*
D03*
Y5025002D02*
D03*
Y4748002D02*
D03*
D25*
X1023008Y8620004D02*
D03*
Y3920001D02*
D03*
D26*
X13736827Y2588644D02*
D03*
X14304773Y2592956D02*
D03*
X13736827Y1572644D02*
D03*
X14304773Y1576956D02*
D03*
D27*
X15724007Y555005D02*
D03*
Y9445005D02*
D03*
D28*
X357008Y555003D02*
D03*
Y9445003D02*
D03*
D29*
X7625080Y4445000D02*
D03*
X7500008Y4568203D02*
D03*
X3746500Y4318000D02*
D03*
Y4660900D02*
D03*
X3759200Y4991100D02*
D03*
Y5321300D02*
D03*
Y5702300D02*
D03*
Y6032500D02*
D03*
Y6362700D02*
D03*
Y6705600D02*
D03*
Y7112000D02*
D03*
X3937000Y3962400D02*
D03*
X3810000D02*
D03*
X3683000D02*
D03*
X3759200Y7429500D02*
D03*
Y7772400D02*
D03*
X3746500Y8102600D02*
D03*
X10274300Y5816600D02*
D03*
Y5626100D02*
D03*
X6042354Y5108246D02*
D03*
X5788354D02*
D03*
X5534354D02*
D03*
X5283200Y5105400D02*
D03*
X5524500Y7645400D02*
D03*
X5782004Y7648904D02*
D03*
X6036004D02*
D03*
X5283200Y7645400D02*
D03*
X5530850Y6388100D02*
D03*
X5791200D02*
D03*
X6045200D02*
D03*
X5283200D02*
D03*
X10505440Y8072120D02*
D03*
X7777480Y5615940D02*
D03*
X7627620Y5773420D02*
D03*
X7777480Y6896100D02*
D03*
X7627620Y7028180D02*
D03*
X7632700Y8305800D02*
D03*
X863600Y1028700D02*
D03*
X1409700Y1155700D02*
D03*
X10591800Y7340600D02*
D03*
X11176000Y7251700D02*
D03*
X11602108Y8467103D02*
D03*
Y8619503D02*
D03*
Y8771903D02*
D03*
X1130300Y3048000D02*
D03*
X11665608Y5368303D02*
D03*
X11767208Y5495303D02*
D03*
X11564008Y5228603D02*
D03*
X11449708Y5101603D02*
D03*
X13314680Y4300220D02*
D03*
Y4554220D02*
D03*
Y4805680D02*
D03*
Y5062220D02*
D03*
Y6207760D02*
D03*
Y6459220D02*
D03*
Y6713220D02*
D03*
Y6967220D02*
D03*
Y8133080D02*
D03*
Y8387080D02*
D03*
Y8643620D02*
D03*
Y8897620D02*
D03*
X12338708Y8009903D02*
D03*
Y8263903D02*
D03*
Y8517903D02*
D03*
Y8771903D02*
D03*
X11602108Y8302003D02*
D03*
X11640208Y7743203D02*
D03*
X11525908Y7628903D02*
D03*
X11411608Y7527303D02*
D03*
X11297308Y7400303D02*
D03*
X12326008Y6079503D02*
D03*
Y6333503D02*
D03*
X12338708Y6587503D02*
D03*
Y6841503D02*
D03*
X12351408Y4682503D02*
D03*
Y4936503D02*
D03*
Y4428503D02*
D03*
Y4174503D02*
D03*
X7246008Y4568203D02*
D03*
X6979308Y5279403D02*
D03*
X7309508Y5431803D02*
D03*
X4261508Y4161803D02*
D03*
X4274208Y4492003D02*
D03*
Y4822203D02*
D03*
X4286908Y5152403D02*
D03*
X7322208Y6714503D02*
D03*
X4274208Y6943103D02*
D03*
X4286908Y7933703D02*
D03*
Y5546103D02*
D03*
Y5876303D02*
D03*
Y6536703D02*
D03*
Y6206503D02*
D03*
X6979308Y6536703D02*
D03*
X7500008Y5838203D02*
D03*
X3817008Y4161803D02*
D03*
Y4492003D02*
D03*
Y4822203D02*
D03*
X3804308Y5152403D02*
D03*
X3817008Y5533403D02*
D03*
Y5876303D02*
D03*
Y6206503D02*
D03*
Y6536703D02*
D03*
Y6943103D02*
D03*
X3829708Y7273303D02*
D03*
X3817008Y7603503D02*
D03*
Y7933703D02*
D03*
X7246008Y5825503D02*
D03*
X4286908Y7273303D02*
D03*
Y7768603D02*
D03*
X7500008Y7108203D02*
D03*
X7246008D02*
D03*
X7271408Y8022603D02*
D03*
X6966608Y7806703D02*
D03*
%TF.MD5,8a9d7962d5ebce5683a72002f6f6377c*%
M02*
