{
  "name": "moveTo",
  "tags": [
    {
      "name": "setter",
      "description": "absolute move to position, idempotent modification"
    }
  ],
  "description": "absolute move to position",
  "params": [
    { "name": "position", "schema": { "type": "number" } }
  ],
  "result": {
    "name": "moveToTargetReply", "schema": { "type": "boolean" }
  }
},
{
  "name": "moveBy",
  "description": "relative move to position, not idempotent",
  "params": [
    { "name": "position", "schema": { "type": "number" } }
  ],
  "result": {
    "name": "moveByTargetReply", "schema": { "type": "boolean" }
  }
},
{
  "name": "isMoving",
  "tags": [
    {
      "name": "getter",
      "description": "service is left un-modified, this is a getter"
    }
  ],
  "description": "check if device is moving",
  "params": [],
  "result": {
    "name": "isMovingReply", "schema": { "type": "boolean" }
  }
}