<svg xmlns="http://www.w3.org/2000/svg" xmlns:xlink="http://www.w3.org/1999/xlink" width="62" height="20" role="img"
    aria-label="linter: @LINT_COUNT@">
    <title>linter: @LINT_COUNT@</title>
    <linearGradient id="s" x2="0" y2="100%">
        <stop offset="0" stop-color="#bbb" stop-opacity=".1" />
        <stop offset="1" stop-opacity=".1" />
    </linearGradient>
    <clipPath id="r">
        <rect width="62" height="20" rx="3" fill="#fff" />
    </clipPath>
    <g clip-path="url(#r)">
        <rect width="39" height="20" fill="#555" />
        <rect x="39" width="23" height="20" fill="@BADGE_COLOR@" />
        <rect width="62" height="20" fill="url(#s)" />
    </g>
    <g fill="#fff" text-anchor="middle" font-family="Verdana,Geneva,DejaVu Sans,sans-serif"
        text-rendering="geometricPrecision" font-size="110">


        <text aria-hidden="true" x="205" y="150" fill="#010101"
            fill-opacity=".3" transform="scale(.1)" textLength="290">linter</text>
        <text x="205" y="140"
            transform="scale(.1)" fill="#fff" textLength="290">linter</text>
        <text aria-hidden="true" x="495" y="150"
            fill="#010101" fill-opacity=".3" transform="scale(.1)" textLength="130">@LINT_COUNT@</text>
        <text x="495" y="140"
            transform="scale(.1)" fill="#fff" textLength="130">@LINT_COUNT@</text>
    </g>
</svg>
