DB_ERROR_SIMU;
// Compiling the PCO Sections for BIC_TZ76_1_TZ76_1
BIC_TZ76_1_TZ76_1_IL;
BIC_TZ76_1_TZ76_1_CL;
BIC_TZ76_1_TZ76_1_BL;
BIC_TZ76_1_TZ76_1_INST;
BIC_TZ76_1_TZ76_1_GL;
BIC_TZ76_1_TZ76_1_TL;
BIC_TZ76_1_TZ76_1_SL;
BIC_TZ76_1_TZ76_1_CDOL;
// Compiling the PCO Dependent Sections for BIC_TZ76_1_TZ76_1
// Compiling the DL of the Dependent Devices for BIC_TZ76_1_TZ76_1
BIC_TZ76_1_B1_A_OF_DL;
BIC_TZ76_1_B2_A_OF_DL;
BIC_TZ76_1_B1_B_OF_DL;
BIC_TZ76_1_B2_B_OF_DL;
// Compiling the PCO Sections for NO_Master
// Compiling the PCO Dependent Sections for NO_Master
// Compiling the DL of the Dependent Devices for NO_Master
BIC_TZ76_1_TZ76_1_DL;

FC_CONTROLLER;
FC_PCO_LOGIC;
	
