
(*Launch of the SCL files********************************************************)
//Data types and functions

Recipes;

CPC_BASE_Unicos;
CPC_TSPP_Unicos;

(*FBs**************************)
CPC_FB_AI;
CPC_FB_DO;
CPC_FB_DPAR;
CPC_FB_APAR;
CPC_FB_WS;
CPC_FB_ONOFF;
CPC_FB_PCO;
CPC_FB_DA;
CPC_FB_AA;
