DB_ERROR_SIMU;
// Compiling the PCO Sections for BIC_UA83_UA83
BIC_UA83_UA83_IL;
BIC_UA83_UA83_CL;
BIC_UA83_UA83_BL;
BIC_UA83_UA83_INST;
BIC_UA83_UA83_GL;
BIC_UA83_UA83_TL;
BIC_UA83_UA83_SL;
BIC_UA83_UA83_CDOL;
// Compiling the PCO Dependent Sections for BIC_UA83_UA83
// Compiling the DL of the Dependent Devices for BIC_UA83_UA83
BIC_UA83_B1_A_OF_DL;
BIC_UA83_B2_A_OF_DL;
BIC_UA83_INJ_A_OF_DL;
BIC_UA83_B1_B_OF_DL;
BIC_UA83_B2_B_OF_DL;
BIC_UA83_INJ_B_OF_DL;
// Compiling the PCO Sections for NO_Master
// Compiling the PCO Dependent Sections for NO_Master
// Compiling the DL of the Dependent Devices for NO_Master
BIC_UA83_UA83_DL;

FC_CONTROLLER;
FC_PCO_LOGIC;
	
