<html xmlns="http://www.w3.org/1999/xhtml">
<head>
<style type="text/css">
.header-sitetitle {	
	PADDING-BOTTOM: 1px; MARGIN: 0px; PADDING-LEFT: 5px; PADDING-RIGHT: 0px; FONT-FAMILY: verdana; VERTICAL-ALIGN: middle; PADDING-TOP: 4px; COLOR: #3861aa 
}
TABLE {
	PADDING-BOTTOM: 0px; BORDER-RIGHT-WIDTH: 0px; PADDING-LEFT: 0px; PADDING-RIGHT: 0px; BORDER-COLLAPSE: collapse; BORDER-TOP-WIDTH: 1px; BORDER-BOTTOM-WIDTH: 1px; BORDER-LEFT-WIDTH: 1px; PADDING-TOP: 0px
}
TABLE.card {
	BORDER-BOTTOM: 1px solid; BORDER-LEFT: 1px solid; MARGIN-BOTTOM: 4px; BORDER-TOP: 1px solid; BORDER-RIGHT: 1px solid; FONT-FAMILY: verdana; font-size: 12px
}
TR.tableHeader TD {
	BORDER-BOTTOM: 1px solid; HEIGHT: 28px; VERTICAL-ALIGN: middle; BORDER-TOP: 1px solid; FONT-WEIGHT: bold; BORDER-BOTTOM-COLOR: #79a7e3; BACKGROUND-COLOR: #79a7e3; BORDER-TOP-COLOR: #79a7e3; BACKGROUND-REPEAT: repeat-x; BACKGROUND-POSITION: 50% top; COLOR: #003399; FONT-FAMILY: verdana; font-size: 12px
}
TR.cmwItem TD {
	BORDER-BOTTOM: 1px solid; HEIGHT: 28px; VERTICAL-ALIGN: middle; BORDER-TOP: 1px solid; FONT-WEIGHT: bold; BORDER-BOTTOM-COLOR: #79a7e3; BACKGROUND-COLOR: #79BBFF; BORDER-TOP-COLOR: #79a7e3; BACKGROUND-REPEAT: repeat-x; BACKGROUND-POSITION: 50% top; COLOR: #003399; FONT-FAMILY: verdana; font-size: 12px
}
TR.publicationHeader TD {
	BORDER-BOTTOM: 1px solid; HEIGHT: 28px; VERTICAL-ALIGN: middle; BORDER-TOP: 1px solid; FONT-WEIGHT: bold; BORDER-BOTTOM-COLOR: #79a7e3; BACKGROUND-COLOR: #79DDAA; BORDER-TOP-COLOR: #79a7e3; BACKGROUND-REPEAT: repeat-x; BACKGROUND-POSITION: 50% top; COLOR: #003399; FONT-FAMILY: verdana; font-size: 12px
}
TR.cardHead TH {
	BORDER-BOTTOM: 1px solid; HEIGHT: 28px; BORDER-TOP: 1px solid; FONT-WEIGHT: bold
}
TABLE.card TD {
	PADDING-BOTTOM: 2px; MARGIN: 0px; PADDING-LEFT: 2px; PADDING-RIGHT: 2px; PADDING-TOP: 2px
}
TABLE.card TD TD {
	PADDING-BOTTOM: 0px; MARGIN: 0px; PADDING-LEFT: 0px; PADDING-RIGHT: 0px; PADDING-TOP: 0px
}
TR.subcard TD {
	BORDER-BOTTOM: 1px solid
}
TR.subcardHead TD {
	BORDER-BOTTOM: 1px solid; BORDER-TOP: 1px solid; FONT-WEIGHT: bold
}
.publicationsTable tr td{
	border-color: #000000; border-width: 1px; border-style: solid; padding: 25px; font-family: verdana; font-size: 12px
}

</style>
<meta http-equiv="Content-Type" content="text/html; charset=utf-8" />
<title>CERN - Cmw Publications</title>


</head>

<body>
<div>
    <table cellpadding="0" cellspacing="0" border="0">
	  <tr>
    	    <td width="63"><img src="../../../Resources/ExtendedConfigGenerator/config/Cmw/Common/cernlogo.jpg" alt="CERN logo" border="0"/></td>
            <td width="915" class="header-sitetitle"><H1 class="header-sitetitle">CMW Publications</H1></td>
          </tr>
    </table>
    <br/>
</div>
<div>

<TABLE >
	  <TBODY>
	    <TR class="tableHeader">
		<TD colSpan="2">Generation Information</TD>
	    </TR>
  	    <TR>
		<TD colSpan="2">
			<table width="100%" border="0" >
			    <tr valign="top" style="border-style:None;">
				<td width="21%"><b>Project:&nbsp;</b></td><td width="79%">LHC_COL_us15</td>
			    </tr><tr valign="top" style="border-style:None;">
				<td><b>Application:&nbsp;</b></td><td>LHC_COL_US15</td>
			    </tr><tr valign="top" style="border-style:None;">
				<td><b>Generation Plug-in:&nbsp;</b></td><td>ExtendedConfigGenerator v1.2.2</td>
			    </tr><tr valign="top" style="border-style:None;">
				<td><b>Generation date:&nbsp;</b></td><td>28/2/2018 17:40:33</td>
			    </tr><tr valign="top" style="border-style:None;">
				<td><b>User:&nbsp;</b></td><td>glunghi</td>
			    </tr><tr valign="top" style="border-style:None;">
				<td><b>Computer:&nbsp;</b></td><td>PCEN35120</td>
			    </tr>
			</table></TD>
	    </TR>
	    <TR class="subcardHead">
		<TD colspan="2"><br/>Cmw Publications Table</TD>
	    </TR>
	    <TR>
		<TD colSpan="2">
<table rules="all" border="1" id="publicationsTable">