<?xml version="1.0" encoding="ascii"?>
<anomalies>
   <global>
      <widget_size x="305" y="67" />
         <ref_panels>
            <AA>objects/GCS_ANOMALIES_OBJECTS/gcsAnomaliesAApanel.pnl</AA>
            <DA>objects/GCS_ANOMALIES_OBJECTS/gcsAnomaliesDApanel.pnl</DA>
         </ref_panels>
   </global>
