<?xml version="1.0" encoding="UTF-8" standalone="no"?>
<!-- Created with Inkscape (http://www.inkscape.org/) -->

<svg
   xmlns:dc="http://purl.org/dc/elements/1.1/"
   xmlns:cc="http://creativecommons.org/ns#"
   xmlns:rdf="http://www.w3.org/1999/02/22-rdf-syntax-ns#"
   xmlns:svg="http://www.w3.org/2000/svg"
   xmlns="http://www.w3.org/2000/svg"
   xmlns:xlink="http://www.w3.org/1999/xlink"
   xmlns:sodipodi="http://sodipodi.sourceforge.net/DTD/sodipodi-0.dtd"
   xmlns:inkscape="http://www.inkscape.org/namespaces/inkscape"
   width="32px"
   height="32px"
   id="svg3800"
   version="1.1"
   inkscape:version="0.48.4 r9939"
   sodipodi:docname="New document 3">
  <defs
     id="defs3802">
    <linearGradient
       inkscape:collect="always"
       xlink:href="#linearGradient26-paper-sheet-orig-0-7-2"
       id="linearGradient84161-5"
       gradientUnits="userSpaceOnUse"
       gradientTransform="matrix(0.922306,0,0,0.918575,44.359242,-14.704744)"
       x1="-19.031248"
       y1="12.617871"
       x2="-28.789402"
       y2="14.069944" />
    <linearGradient
       inkscape:collect="always"
       id="linearGradient26-paper-sheet-orig-0-7-2">
      <stop
         style="stop-color: rgb(0, 0, 0); stop-opacity: 0.554054;"
         offset="0"
         id="stop30-paper-sheet-orig-8-4-4" />
      <stop
         style="stop-color: rgb(0, 0, 0); stop-opacity: 0;"
         offset="1"
         id="stop31-paper-sheet-orig-8-9-6" />
    </linearGradient>
    <radialGradient
       r="7.0421038"
       fy="10.108011"
       fx="-26.305403"
       cy="10.108011"
       cx="-26.305403"
       gradientTransform="matrix(0.407336,-0.279828,0.751029,1.09325,21.621242,-24.468344)"
       gradientUnits="userSpaceOnUse"
       id="radialGradient6710"
       xlink:href="#linearGradient13-paper-sheet-orig-7-4-5"
       inkscape:collect="always" />
    <linearGradient
       id="linearGradient13-paper-sheet-orig-7-4-5">
      <stop
         id="stop19-paper-sheet-orig-0-5-6"
         offset="0"
         style="stop-color: rgb(255, 255, 255); stop-opacity: 1;" />
      <stop
         style="stop-color: rgb(255, 255, 255); stop-opacity: 1;"
         offset="0.47533694"
         id="stop20-paper-sheet-orig-0-7-6" />
      <stop
         id="stop21-paper-sheet-orig-6-9-1"
         offset="1"
         style="stop-color: rgb(255, 255, 255); stop-opacity: 0;" />
    </linearGradient>
    <inkscape:path-effect
       effect="spiro"
       id="path-effect96277"
       is_visible="true" />
    <radialGradient
       inkscape:collect="always"
       xlink:href="#linearGradient3-paper-sheet-orig-08-3-9"
       id="radialGradient96231"
       gradientUnits="userSpaceOnUse"
       gradientTransform="matrix(1.9361091,-0.03547674,0.02666758,1.4553578,481.62353,-188.9076)"
       cx="-83.651741"
       cy="242.12727"
       fx="-79.775887"
       fy="251.23422"
       r="18.000002" />
    <linearGradient
       id="linearGradient3-paper-sheet-orig-08-3-9">
      <stop
         style="stop-color: rgb(255, 255, 255); stop-opacity: 1;"
         offset="0"
         id="stop6-paper-sheet-orig-1-5-7" />
      <stop
         style="stop-color: rgb(211, 215, 207); stop-opacity: 1;"
         offset="1"
         id="stop7-paper-sheet-orig-2-1-9" />
    </linearGradient>
    <linearGradient
       inkscape:collect="always"
       xlink:href="#linearGradient10-paper-sheet-orig-3-9-3"
       id="linearGradient96233"
       gradientUnits="userSpaceOnUse"
       gradientTransform="matrix(0.157303,0,0,0.157303,363.94083,103.68586)"
       x1="-274.72217"
       y1="452.54453"
       x2="-268.20242"
       y2="322.98654" />
    <linearGradient
       inkscape:collect="always"
       id="linearGradient10-paper-sheet-orig-3-9-3">
      <stop
         style="stop-color: rgb(85, 87, 83); stop-opacity: 1;"
         offset="0"
         id="stop15-paper-sheet-orig-7-1-0" />
      <stop
         style="stop-color: rgb(186, 189, 182); stop-opacity: 1;"
         offset="1"
         id="stop16-paper-sheet-orig-8-3-0" />
    </linearGradient>
    <filter
       inkscape:collect="always"
       id="filter3913-4"
       x="-0.092477873"
       width="1.1849558"
       y="-1.6646018"
       height="4.3292036"
       color-interpolation-filters="sRGB">
      <feGaussianBlur
         inkscape:collect="always"
         stdDeviation="1.3871681"
         id="feGaussianBlur3915-1" />
    </filter>
    <filter
       inkscape:collect="always"
       id="filter3871-0"
       x="-0.053244837"
       width="1.1064897"
       y="-0.9584071"
       height="2.9168141"
       color-interpolation-filters="sRGB">
      <feGaussianBlur
         inkscape:collect="always"
         stdDeviation="0.79867257"
         id="feGaussianBlur3873-5" />
    </filter>
    <radialGradient
       inkscape:collect="always"
       xlink:href="#linearGradient3-paper-sheet-orig-08"
       id="radialGradient84179"
       gradientUnits="userSpaceOnUse"
       gradientTransform="matrix(3.854,0,0,1.86639,442.334,21.2596)"
       cx="-30.249996"
       cy="35.357208"
       fx="-30.249996"
       fy="35.357208"
       r="18.000002" />
    <linearGradient
       id="linearGradient3-paper-sheet-orig-08">
      <stop
         style="stop-color: rgb(255, 255, 255); stop-opacity: 1;"
         offset="0"
         id="stop6-paper-sheet-orig-1" />
      <stop
         style="stop-color: rgb(211, 215, 207); stop-opacity: 1;"
         offset="1"
         id="stop7-paper-sheet-orig-2" />
    </linearGradient>
    <linearGradient
       inkscape:collect="always"
       xlink:href="#linearGradient10-paper-sheet-orig-3"
       id="linearGradient84181"
       gradientUnits="userSpaceOnUse"
       gradientTransform="translate(356,50)"
       x1="-40.278805"
       y1="70.736046"
       x2="-52.75"
       y2="3.8729248" />
    <linearGradient
       inkscape:collect="always"
       id="linearGradient10-paper-sheet-orig-3">
      <stop
         style="stop-color: rgb(85, 87, 83); stop-opacity: 1;"
         offset="0"
         id="stop15-paper-sheet-orig-7" />
      <stop
         style="stop-color: rgb(186, 189, 182); stop-opacity: 1;"
         offset="1"
         id="stop16-paper-sheet-orig-8" />
    </linearGradient>
    <radialGradient
       inkscape:collect="always"
       xlink:href="#linearGradient4-paper-sheet-orig-7"
       id="radialGradient84183"
       gradientUnits="userSpaceOnUse"
       gradientTransform="matrix(3.23437,0,0,1.52429,-8.93747,-6.07875)"
       cx="4"
       cy="5.2999997"
       fx="4"
       fy="5.2999997"
       r="17" />
    <linearGradient
       id="linearGradient4-paper-sheet-orig-7"
       inkscape:collect="always">
      <stop
         id="stop8-paper-sheet-orig-2"
         offset="0"
         style="stop-color: rgb(255, 255, 255); stop-opacity: 1;" />
      <stop
         id="stop9-paper-sheet-orig-2"
         offset="1"
         style="stop-color: rgb(255, 255, 255); stop-opacity: 0;" />
    </linearGradient>
    <linearGradient
       inkscape:collect="always"
       xlink:href="#linearGradient12-paper-sheet-orig-2"
       id="linearGradient84185"
       gradientUnits="userSpaceOnUse"
       x1="-26.753757"
       y1="11.566258"
       x2="-24.75"
       y2="9.687501" />
    <linearGradient
       id="linearGradient12-paper-sheet-orig-2"
       inkscape:collect="always">
      <stop
         id="stop17-paper-sheet-orig-1"
         offset="0"
         style="stop-color: rgb(255, 255, 255); stop-opacity: 1;" />
      <stop
         id="stop18-paper-sheet-orig-0"
         offset="1"
         style="stop-color: rgb(255, 255, 255); stop-opacity: 0;" />
    </linearGradient>
    <linearGradient
       inkscape:collect="always"
       xlink:href="#linearGradient2065-5"
       id="linearGradient84058"
       gradientUnits="userSpaceOnUse"
       gradientTransform="translate(138.477,-54.4383)"
       x1="-11.986486"
       y1="13.122552"
       x2="-11.986486"
       y2="29.726542" />
    <linearGradient
       id="linearGradient2065-5"
       inkscape:collect="always">
      <stop
         id="stop2067-7"
         offset="0"
         style="stop-color: rgb(85, 87, 83);" />
      <stop
         id="stop2069-6"
         offset="1"
         style="stop-color: rgb(252, 175, 62);" />
    </linearGradient>
    <radialGradient
       inkscape:collect="always"
       xlink:href="#linearGradient4928-0"
       id="radialGradient84060"
       gradientUnits="userSpaceOnUse"
       gradientTransform="matrix(1,-1.48718e-8,1.42553e-8,0.958546,125.193,-52.8623)"
       cx="-6.0070167"
       cy="32.837029"
       fx="-6.0070167"
       fy="32.837029"
       r="9.90625" />
    <linearGradient
       id="linearGradient4928-0">
      <stop
         style="stop-color: rgb(252, 233, 79); stop-opacity: 1;"
         offset="0"
         id="stop4930-5" />
      <stop
         style="stop-color: rgb(252, 233, 79); stop-opacity: 0;"
         offset="1"
         id="stop4932-4" />
    </linearGradient>
    <linearGradient
       inkscape:collect="always"
       xlink:href="#linearGradient4616-1"
       id="linearGradient84062"
       gradientUnits="userSpaceOnUse"
       gradientTransform="translate(102.477,-54.4383)"
       x1="25.355263"
       y1="34.006802"
       x2="25.355263"
       y2="32.409008" />
    <linearGradient
       id="linearGradient4616-1"
       inkscape:collect="always">
      <stop
         id="stop4618-9"
         offset="0"
         style="stop-color: rgb(46, 52, 54); stop-opacity: 1;" />
      <stop
         id="stop4620-2"
         offset="1"
         style="stop-color: rgb(46, 52, 54); stop-opacity: 0;" />
    </linearGradient>
    <radialGradient
       inkscape:collect="always"
       xlink:href="#linearGradient3-paper-sheet-orig-08"
       id="radialGradient4068"
       gradientUnits="userSpaceOnUse"
       gradientTransform="matrix(3.854,0,0,1.86639,442.334,21.2596)"
       cx="-30.249996"
       cy="35.357208"
       fx="-30.249996"
       fy="35.357208"
       r="18.000002" />
    <linearGradient
       inkscape:collect="always"
       xlink:href="#linearGradient10-paper-sheet-orig-3"
       id="linearGradient4070"
       gradientUnits="userSpaceOnUse"
       gradientTransform="translate(356,50)"
       x1="-40.278805"
       y1="70.736046"
       x2="-52.75"
       y2="3.8729248" />
    <radialGradient
       inkscape:collect="always"
       xlink:href="#linearGradient4-paper-sheet-orig-7"
       id="radialGradient4072"
       gradientUnits="userSpaceOnUse"
       gradientTransform="matrix(3.23437,0,0,1.52429,-8.93747,-6.07875)"
       cx="4"
       cy="5.2999997"
       fx="4"
       fy="5.2999997"
       r="17" />
    <linearGradient
       inkscape:collect="always"
       xlink:href="#linearGradient12-paper-sheet-orig-2"
       id="linearGradient4074"
       gradientUnits="userSpaceOnUse"
       x1="-26.753757"
       y1="11.566258"
       x2="-24.75"
       y2="9.687501" />
    <linearGradient
       inkscape:collect="always"
       xlink:href="#linearGradient2065-5"
       id="linearGradient4076"
       gradientUnits="userSpaceOnUse"
       gradientTransform="translate(138.477,-54.4383)"
       x1="-11.986486"
       y1="13.122552"
       x2="-11.986486"
       y2="29.726542" />
    <radialGradient
       inkscape:collect="always"
       xlink:href="#linearGradient4928-0"
       id="radialGradient4078"
       gradientUnits="userSpaceOnUse"
       gradientTransform="matrix(1,-1.48718e-8,1.42553e-8,0.958546,125.193,-52.8623)"
       cx="-6.0070167"
       cy="32.837029"
       fx="-6.0070167"
       fy="32.837029"
       r="9.90625" />
    <linearGradient
       inkscape:collect="always"
       xlink:href="#linearGradient4616-1"
       id="linearGradient4080"
       gradientUnits="userSpaceOnUse"
       gradientTransform="translate(102.477,-54.4383)"
       x1="25.355263"
       y1="34.006802"
       x2="25.355263"
       y2="32.409008" />
    <radialGradient
       inkscape:collect="always"
       xlink:href="#linearGradient3-paper-sheet-orig-08-3-9"
       id="radialGradient4082"
       gradientUnits="userSpaceOnUse"
       gradientTransform="matrix(1.9361091,-0.03547674,0.02666758,1.4553578,481.62353,-188.9076)"
       cx="-83.651741"
       cy="242.12727"
       fx="-79.775887"
       fy="251.23422"
       r="18.000002" />
    <linearGradient
       inkscape:collect="always"
       xlink:href="#linearGradient10-paper-sheet-orig-3-9-3"
       id="linearGradient4084"
       gradientUnits="userSpaceOnUse"
       gradientTransform="matrix(0.157303,0,0,0.157303,363.94083,103.68586)"
       x1="-274.72217"
       y1="452.54453"
       x2="-268.20242"
       y2="322.98654" />
    <radialGradient
       inkscape:collect="always"
       xlink:href="#linearGradient13-paper-sheet-orig-7-4-5"
       id="radialGradient4086"
       gradientUnits="userSpaceOnUse"
       gradientTransform="matrix(0.407336,-0.279828,0.751029,1.09325,21.621242,-24.468344)"
       cx="-26.305403"
       cy="10.108011"
       fx="-26.305403"
       fy="10.108011"
       r="7.0421038" />
    <linearGradient
       inkscape:collect="always"
       xlink:href="#linearGradient26-paper-sheet-orig-0-7-2"
       id="linearGradient4088"
       gradientUnits="userSpaceOnUse"
       gradientTransform="matrix(0.922306,0,0,0.918575,44.359242,-14.704744)"
       x1="-19.031248"
       y1="12.617871"
       x2="-28.789402"
       y2="14.069944" />
  </defs>
  <sodipodi:namedview
     id="base"
     pagecolor="#ffffff"
     bordercolor="#666666"
     borderopacity="1.0"
     inkscape:pageopacity="0.0"
     inkscape:pageshadow="2"
     inkscape:zoom="11.197802"
     inkscape:cx="16"
     inkscape:cy="19.57213"
     inkscape:current-layer="layer1"
     showgrid="true"
     inkscape:grid-bbox="true"
     inkscape:document-units="px"
     inkscape:snap-midpoints="true"
     inkscape:window-width="1920"
     inkscape:window-height="1014"
     inkscape:window-x="0"
     inkscape:window-y="27"
     inkscape:window-maximized="1" />
  <metadata
     id="metadata3805">
    <rdf:RDF>
      <cc:Work
         rdf:about="">
        <dc:format>image/svg+xml</dc:format>
        <dc:type
           rdf:resource="http://purl.org/dc/dcmitype/StillImage" />
        <dc:title></dc:title>
      </cc:Work>
    </rdf:RDF>
  </metadata>
  <g
     id="layer1"
     inkscape:label="Layer 1"
     inkscape:groupmode="layer">
    <g
       id="g4015"
       transform="matrix(0.63952332,0,0,0.63952332,8.8986216,10.511948)">
      <g
         id="g84404"
         style="display:inline;enable-background:new"
         transform="translate(-1913.415,-65.161463)">
        <g
           id="use10155"
           style="display:inline"
           transform="translate(1200.0002,0)">
          <g
             transform="translate(400.044,1.01491)"
             id="g84165"
             style="display:inline">
            <rect
               style="opacity:0.475;fill:#000000;fill-opacity:1;stroke:none;display:inline;filter:url(#filter3913-4)"
               id="rect84167"
               width="36"
               height="2"
               x="306"
               y="91"
               rx="7.5241151"
               ry="2"
               transform="matrix(1.1189,0,0,1.17678,-38.2578,-16.0867)" />
            <rect
               style="opacity:0.71499999;fill:#000000;fill-opacity:1;stroke:none;filter:url(#filter3871-0)"
               id="rect84169"
               width="36"
               height="2"
               x="306"
               y="91"
               rx="6.3920398"
               ry="2"
               transform="matrix(1.01334,0,0,1,-4.05753,0)" />
          </g>
          <g
             transform="translate(404.044,-0.985092)"
             id="g84171">
            <path
               inkscape:connector-curvature="0"
               sodipodi:nodetypes="ccsccccccc"
               id="path84173"
               d="m 304.52386,53.5 c 0,0 17.47614,0 18.97614,0 3.87705,0.07294 6.5,2.5 9,5 2.5,2.5 4.60768,5.252625 5,9 0,1.5 0,24.97614 0,24.97614 0,1.12122 -0.90264,2.02386 -2.02385,2.02386 l -30.95229,0 C 303.40264,94.5 302.5,93.59736 302.5,92.47614 l 0,-36.952282 C 302.5,54.402641 303.40264,53.5 304.52386,53.5 z"
               style="fill:url(#radialGradient4068);fill-opacity:1;stroke:url(#linearGradient4070);stroke-width:1;stroke-miterlimit:4;display:inline" />
            <path
               transform="translate(296,50)"
               d="M 8.53125,4 C 7.6730803,4 7,4.6730802 7,5.53125 l 0,36.9375 C 7,43.32692 7.6730802,44 8.53125,44 l 30.9375,0 C 40.326919,44 41,43.326918 41,42.46875 L 41,17.5 c 0,-1.39197 -0.486979,-4.299479 -2.34375,-6.15625 l -5,-5 C 31.799479,4.4869792 28.89197,4 27.5,4 L 8.53125,4 z"
               id="path84175"
               style="fill:url(#radialGradient4072);fill-opacity:1;stroke:none;display:inline"
               inkscape:original="M 8.53125 3.5 C 7.410033 3.5 6.5 4.4100329 6.5 5.53125 L 6.5 42.46875 C 6.5 43.589967 7.4100329 44.5 8.53125 44.5 L 39.46875 44.5 C 40.589967 44.5 41.5 43.589966 41.5 42.46875 C 41.5 42.46875 41.5 19 41.5 17.5 C 41.5 16 41 13 39 11 C 37 9 36 8 34 6 C 32 4 29 3.5 27.5 3.5 C 26 3.5 8.5312499 3.5 8.53125 3.5 z "
               inkscape:radius="-0.4861359"
               sodipodi:type="inkscape:offset" />
            <path
               transform="translate(356,50)"
               d="M -51.46875,4.5 C -52.051916,4.5 -52.5,4.9480842 -52.5,5.53125 l 0,36.9375 c 0,0.583165 0.448086,1.03125 1.03125,1.03125 l 30.9375,0 c 0.583165,0 1.03125,-0.448086 1.03125,-1.03125 L -19.5,17.5 c 0,-1.279029 -0.480469,-4.105469 -2.1875,-5.8125 l -5,-5 C -28.394531,4.9804687 -31.220971,4.5 -32.5,4.5 l -18.96875,0 z"
               id="path84177"
               style="fill:none;stroke:url(#linearGradient4074);stroke-width:1;stroke-miterlimit:4;display:inline"
               inkscape:original="M -51.46875 3.5 C -52.589967 3.5 -53.5 4.4100329 -53.5 5.53125 L -53.5 42.46875 C -53.5 43.589967 -52.589966 44.5 -51.46875 44.5 L -20.53125 44.5 C -19.410033 44.5 -18.5 43.589966 -18.5 42.46875 C -18.5 42.46875 -18.5 19 -18.5 17.5 C -18.5 16 -19 13 -21 11 C -23 9 -24 8 -26 6 C -28 4 -31 3.5 -32.5 3.5 C -34 3.5 -51.468749 3.5 -51.46875 3.5 z "
               inkscape:radius="-0.99436891"
               sodipodi:type="inkscape:offset" />
          </g>
        </g>
        <g
           transform="translate(1603.0003,-274.4226)"
           id="g34995">
          <g
             style="display:inline"
             id="g3757"
             transform="translate(0,-26.6369)"
             inkscape:export-filename="/home/lapo/Scrivania/use4934.png"
             inkscape:export-xdpi="90"
             inkscape:export-ydpi="90">
            <g
               id="g6121"
               transform="translate(296,349.997)">
              <rect
                 ry="0.46875"
                 rx="0.46875009"
                 inkscape:r_cy="true"
                 inkscape:r_cx="true"
                 y="9.0625"
                 x="11.000001"
                 height="0.9375"
                 width="16.771515"
                 id="rect6123"
                 style="opacity:0.51098902;fill:#8d8d8d;fill-opacity:1;fill-rule:evenodd;stroke:none;stroke-width:1px;marker:none;visibility:visible;display:inline;overflow:visible" />
              <rect
                 ry="0.50145501"
                 rx="0.50145501"
                 inkscape:r_cy="true"
                 inkscape:r_cx="true"
                 y="13"
                 x="11.000001"
                 height="1.00291"
                 width="25.00001"
                 id="rect6127"
                 style="opacity:0.51098902;fill:#8d8d8d;fill-opacity:1;fill-rule:evenodd;stroke:none;stroke-width:1px;marker:none;visibility:visible;display:inline;overflow:visible" />
              <rect
                 style="opacity:0.51098902;fill:#8d8d8d;fill-opacity:1;fill-rule:evenodd;stroke:none;stroke-width:1px;marker:none;visibility:visible;display:inline;overflow:visible"
                 id="rect6129"
                 width="21"
                 height="0.99999964"
                 x="11.00001"
                 y="15.00291"
                 inkscape:r_cx="true"
                 inkscape:r_cy="true"
                 rx="0.49999982"
                 ry="0.49999982" />
              <rect
                 style="opacity:0.51098902;fill:#8d8d8d;fill-opacity:1;fill-rule:evenodd;stroke:none;stroke-width:1px;marker:none;visibility:visible;display:inline;overflow:visible"
                 id="rect6131"
                 width="16.771515"
                 height="0.9375"
                 x="11.000001"
                 y="17.0625"
                 inkscape:r_cx="true"
                 inkscape:r_cy="true"
                 rx="0.46875009"
                 ry="0.46875" />
              <rect
                 ry="0.46875"
                 rx="0.46875009"
                 inkscape:r_cy="true"
                 inkscape:r_cx="true"
                 y="35.0625"
                 x="11.000001"
                 height="0.9375"
                 width="27"
                 id="rect6133"
                 style="opacity:0.51098902;fill:#8d8d8d;fill-opacity:1;fill-rule:evenodd;stroke:none;stroke-width:1px;marker:none;visibility:visible;display:inline;overflow:visible" />
              <rect
                 style="opacity:0.51098902;fill:#8d8d8d;fill-opacity:1;fill-rule:evenodd;stroke:none;stroke-width:1px;marker:none;visibility:visible;display:inline;overflow:visible"
                 id="rect6135"
                 width="27"
                 height="0.9375"
                 x="11.000001"
                 y="37.0625"
                 inkscape:r_cx="true"
                 inkscape:r_cy="true"
                 rx="0.46875009"
                 ry="0.46875" />
              <rect
                 ry="0.46875"
                 rx="0.46875009"
                 inkscape:r_cy="true"
                 inkscape:r_cx="true"
                 y="39.0625"
                 x="11.000001"
                 height="0.9375"
                 width="9.999999"
                 id="rect6137"
                 style="opacity:0.51098902;fill:#8d8d8d;fill-opacity:1;fill-rule:evenodd;stroke:none;stroke-width:1px;marker:none;visibility:visible;display:inline;overflow:visible" />
            </g>
            <g
               inkscape:r_cy="true"
               inkscape:r_cx="true"
               transform="matrix(0.30622,0,0,1,322.632,347.997)"
               id="g6139">
              <rect
                 style="opacity:0.51098902;fill:#8d8d8d;fill-opacity:1;fill-rule:evenodd;stroke:none;stroke-width:1px;marker:none;visibility:visible;display:inline;overflow:visible"
                 id="rect6141"
                 width="26.125004"
                 height="0.9375"
                 x="11.000001"
                 y="23.0625"
                 inkscape:r_cx="true"
                 inkscape:r_cy="true"
                 rx="1.5307624"
                 ry="0.46875" />
              <rect
                 ry="0.46875"
                 rx="1.5307624"
                 inkscape:r_cy="true"
                 inkscape:r_cx="true"
                 y="25.0625"
                 x="11.000001"
                 height="0.9375"
                 width="26.125004"
                 id="rect6143"
                 style="opacity:0.51098902;fill:#8d8d8d;fill-opacity:1;fill-rule:evenodd;stroke:none;stroke-width:1px;marker:none;visibility:visible;display:inline;overflow:visible" />
              <rect
                 ry="0.46875"
                 rx="1.5307624"
                 inkscape:r_cy="true"
                 inkscape:r_cx="true"
                 y="27.0625"
                 x="11.000001"
                 height="0.9375"
                 width="26.125004"
                 id="rect6145"
                 style="opacity:0.51098902;fill:#8d8d8d;fill-opacity:1;fill-rule:evenodd;stroke:none;stroke-width:1px;marker:none;visibility:visible;display:inline;overflow:visible" />
              <rect
                 style="opacity:0.51098902;fill:#8d8d8d;fill-opacity:1;fill-rule:evenodd;stroke:none;stroke-width:1px;marker:none;visibility:visible;display:inline;overflow:visible"
                 id="rect6147"
                 width="26.125004"
                 height="0.9375"
                 x="11.000001"
                 y="29.0625"
                 inkscape:r_cx="true"
                 inkscape:r_cy="true"
                 rx="1.5307624"
                 ry="0.46875" />
              <rect
                 style="opacity:0.51098902;fill:#8d8d8d;fill-opacity:1;fill-rule:evenodd;stroke:none;stroke-width:1px;marker:none;visibility:visible;display:inline;overflow:visible"
                 id="rect6149"
                 width="26.125004"
                 height="0.9375"
                 x="11.000001"
                 y="31.0625"
                 inkscape:r_cx="true"
                 inkscape:r_cy="true"
                 rx="1.5307624"
                 ry="0.46875" />
              <rect
                 ry="0.46875"
                 rx="1.5307624"
                 inkscape:r_cy="true"
                 inkscape:r_cx="true"
                 y="33.0625"
                 x="11.000001"
                 height="0.9375"
                 width="12.830279"
                 id="rect6151"
                 style="opacity:0.51098902;fill:#8d8d8d;fill-opacity:1;fill-rule:evenodd;stroke:none;stroke-width:1px;marker:none;visibility:visible;display:inline;overflow:visible" />
            </g>
            <g
               inkscape:r_cy="true"
               inkscape:r_cx="true"
               transform="matrix(0.487331,0,0,0.500001,253.892,392.466)"
               id="g6153">
              <rect
                 inkscape:r_cy="true"
                 inkscape:r_cx="true"
                 style="fill:url(#linearGradient4076);fill-opacity:1;stroke:none"
                 id="rect6155"
                 width="35.027027"
                 height="24"
                 x="108.97698"
                 y="-42.938244"
                 rx="0.89774978"
                 ry="0.8749994" />
              <path
                 inkscape:connector-curvature="0"
                 style="fill:url(#radialGradient4078);fill-opacity:1;fill-rule:evenodd;stroke:none;stroke-width:1;marker:none;visibility:visible;display:inline;overflow:visible"
                 d="m 118.56077,-31.886469 c -5.16878,0.327955 -9.28125,4.655188 -9.28125,9.90625 0,0.202785 0.0192,0.393975 0.0313,0.59375 l 19.75,0 c 0.012,-0.199775 0.0313,-0.390965 0.0313,-0.59375 0,-5.464521 -4.44173,-9.90625 -9.90625,-9.90625 -0.21346,0 -0.41489,-0.01333 -0.625,0 l -10e-5,0 0,0 z"
                 id="path6157"
                 inkscape:r_cx="true"
                 inkscape:r_cy="true" />
              <rect
                 inkscape:r_cy="true"
                 inkscape:r_cx="true"
                 style="fill:url(#linearGradient4080);fill-opacity:1;stroke:none"
                 id="rect6159"
                 width="34"
                 height="2"
                 x="109.47698"
                 y="-21.438248"
                 rx="0"
                 ry="0" />
              <path
                 inkscape:connector-curvature="0"
                 inkscape:r_cy="true"
                 inkscape:r_cx="true"
                 style="fill:#000000;fill-opacity:1;fill-rule:evenodd;stroke:none"
                 d="m 132.03256,-20.465974 c 0,0 -0.55558,-3.083355 -0.55558,-4.972272 0.0154,-0.861699 7.78671,-7.574609 7.80676,-8.574524 l -1.80676,1.574524 -1.26516,-3.441942 4.26516,0.441942 2,-2 -2.26516,1.662913 -0.77903,-0.176777 -0.95581,-3.486136 0.48614,3.397748 -3.53033,-0.176777 1.10485,2.811961 -3.06066,-3.032932 3.23744,4.221464 c 8e-5,0.941528 -6.38088,6.689202 -6.37002,5.698133 l -2.64645,-3.549578 -0.22097,-4.79859 2,-0.571429 1.75215,-4.320621 -2.30972,3.993315 -1.80316,-0.0817 -4.03639,-3.409009 -5.54222,-2.121321 4.73483,2.602253 -3.79549,0.337087 5,0 3,3 0.35355,5.181981 -5.35355,-5.181981 2.2513,2.707107 -3.2513,2.292893 3.57143,-2 5.64954,7.116117 -0.22097,4.856155 2.55558,0 0,-4e-6 0,0 z"
                 id="path6161"
                 sodipodi:nodetypes="cccccccccccccccccccccccccccccccccccc" />
              <path
                 inkscape:connector-curvature="0"
                 inkscape:r_cy="true"
                 inkscape:r_cx="true"
                 id="path6163"
                 d="m 118.84471,-27.204578 c -2.82054,0.178961 -5.06466,2.540279 -5.06466,5.405719 0,0.110657 0.0105,0.214987 0.017,0.324002 l 10.77733,0 c 0.007,-0.109015 0.0171,-0.213345 0.0171,-0.324002 0,-2.981922 -2.4238,-5.405719 -5.40572,-5.405719 -0.11648,0 -0.2264,-0.0073 -0.34106,0 l 1e-5,0 0,0 z"
                 style="fill:#fef39e;fill-opacity:1;fill-rule:evenodd;stroke:none;stroke-width:1;marker:none;visibility:visible;display:inline;overflow:visible" />
              <path
                 inkscape:connector-curvature="0"
                 style="fill:#fffbd7;fill-opacity:0.55681799;fill-rule:evenodd;stroke:none;stroke-width:1;marker:none;visibility:visible;display:inline;overflow:visible"
                 d="m 118.92566,-25.906273 c -2.15109,0.136486 -3.86257,1.937349 -3.86257,4.122681 0,0.08439 0.008,0.16396 0.013,0.2471 l 8.21935,0 c 0.005,-0.08314 0.013,-0.162708 0.013,-0.2471 0,-2.274167 -1.84851,-4.122681 -4.12268,-4.122681 -0.0888,0 -0.17266,-0.0055 -0.26011,0 l 10e-6,0 0,0 z"
                 id="path6165"
                 inkscape:r_cx="true"
                 inkscape:r_cy="true" />
            </g>
            <rect
               style="fill:#8d8d8d;fill-opacity:1;fill-rule:evenodd;stroke:none;stroke-width:1px;marker:none;visibility:visible;display:inline;overflow:visible"
               id="rect6823"
               width="16.771515"
               height="0.9375"
               x="307"
               y="359.05957"
               inkscape:r_cx="true"
               inkscape:r_cy="true"
               rx="0.46875009"
               ry="0.46875" />
          </g>
        </g>
        <g
           transform="translate(1564.2212,-0.868975)"
           id="use10163"
           style="display:inline" />
      </g>
      <g
         transform="translate(-350.41495,-72.161453)"
         id="g96094"
         style="display:inline;enable-background:new">
        <rect
           transform="matrix(0.96592582,-0.25881906,0.25881906,0.96592582,0,0)"
           style="color:#000000;fill:url(#radialGradient4082);fill-opacity:1;fill-rule:nonzero;stroke:url(#linearGradient4084);stroke-width:0.99999994;stroke-linecap:butt;stroke-linejoin:miter;stroke-miterlimit:4;stroke-opacity:1;stroke-dasharray:none;stroke-dashoffset:0;marker:none;visibility:visible;display:inline;overflow:visible;enable-background:accumulate"
           id="rect95294"
           width="23.015547"
           height="22.203333"
           x="310.11853"
           y="153.90866" />
      </g>
      <g
         transform="matrix(0.12528742,-0.05294441,-0.05294441,-0.12528742,-0.84560868,63.203557)"
         id="g10960-1"
         style="display:inline;enable-background:new">
        <path
           id="path10887-8"
           style="fill:#ffffff;fill-opacity:1;fill-rule:nonzero;stroke:none"
           d="m 248.069,353.5627 c -2.432,0.5578 -5.011,0.9101 -7.621,0.9101 -4.463,0 -8.5242,-0.7722 -11.5187,-2.0214 -0.3301,-0.1629 -0.5648,-0.5086 -0.5648,-0.9004 0,-0.1446 0.0359,-0.2891 0.0902,-0.4121 0.3543,-1.025 -0.2274,-2.1372 -3.1266,-2.775 -4.2976,-0.945 -7.0113,-5.3801 -8.5629,-6.852 -1.8234,-1.732 -6.9726,-2.7941 -6.1976,-1.7621 0.6066,0.8051 2.923,3.323 4.3328,6.0422 1.2605,2.432 2.3832,3.123 3.9297,5.4437 0.4527,0.6785 2.2121,3.0692 2.7242,4.961 0.5742,1.8437 0.3805,4.1621 0.6012,5.114 0.3164,1.377 1.614,4.3606 1.7117,6.045 0.0566,0.9542 -3.9793,-1.3602 -5.8938,-1.3602 -1.9136,0 -3.7793,1.1484 -5.4898,1.2305 -2.1176,0.0976 -3.4777,-1.6348 -5.3938,-1.3313 -1.0925,0.175 -2.0144,1.1399 -3.9261,1.2102 -2.7219,0.0996 -6.0477,-1.5137 -12.2942,-1.3125 -6.1437,0.2011 -11.8199,7.7664 -12.5941,8.9695 -0.9078,1.4102 -2.0164,1.4102 -3.2242,0.3 -1.2106,-1.1074 -2.7,-0.2363 -3.1242,0.5078 -0.8059,1.4082 -2.9606,5.5293 -6.2981,6.3945 -4.6152,1.1961 -6.9519,-2.5546 -6.6484,-5.5402 0.3078,-3.0301 2.266,-3.8797 3.1738,-5.4902 0.9059,-1.6121 1.3699,-2.6492 3.0769,-3.3621 1.209,-0.5071 1.6594,-1.2512 1.2997,-2.2453 -0.3161,-0.8641 -1.5747,-1.0614 -2.4016,-1.1024 -1.7582,-0.084 -2.991,0.3934 -3.8898,0.9668 -1.0457,0.6688 -1.8961,1.5938 -2.8083,3.1641 -1.0558,1.7343 -2.7187,2.4902 -4.6558,2.4902 -0.9231,0 -1.7871,-0.2434 -2.5547,-0.6387 -3.0355,-1.582 -6.6492,-2.5156 -10.54023,-2.5156 l -4.3875,-0.004 c 8.41403,-24.9551 32.01013,-42.925 59.80503,-42.925 22.2016,0 41.725,11.4648 52.971,28.8008"
           inkscape:connector-curvature="0" />
        <path
           id="path10889-3"
           style="fill:#100f0d;fill-opacity:1;fill-rule:nonzero;stroke:none"
           d="m 257.557,357.349 0,1.0106 0.672,0 c 0.341,0 0.709,-0.0762 0.709,-0.4786 0,-0.4988 -0.37,-0.532 -0.791,-0.532 l -0.59,0 z m 0,-0.418 0.569,0 0.859,-1.4101 0.553,0 -0.93,1.4363 c 0.483,0.0578 0.847,0.3106 0.847,0.8906 0,0.6477 -0.381,0.927 -1.149,0.927 l -1.241,0 0,-3.2539 0.492,0 0,1.4101"
           inkscape:connector-curvature="0" />
        <path
           id="path10891-3"
           style="fill:#100f0d;fill-opacity:1;fill-rule:nonzero;stroke:none"
           d="m 258.141,359.7697 c -1.451,0 -2.626,-1.1758 -2.626,-2.6277 0,-1.4465 1.175,-2.6164 2.626,-2.6164 1.447,0 2.622,1.1699 2.622,2.6164 0,1.4519 -1.175,2.6277 -2.622,2.6277 z m 3.189,-2.6258 c 0,-1.757 -1.429,-3.1867 -3.189,-3.1867 -1.761,0 -3.191,1.4297 -3.191,3.1867 0,1.7606 1.43,3.1903 3.191,3.1903 1.76,0 3.189,-1.4297 3.189,-3.1903"
           inkscape:connector-curvature="0" />
        <path
           id="path10893-6"
           style="fill:#100f0d;fill-opacity:1;fill-rule:nonzero;stroke:none"
           d="m 248.069,353.5588 c -2.432,0.5617 -5.011,0.9101 -7.621,0.9101 -4.463,0 -8.5242,-0.7742 -11.5187,-2.0175 -0.3301,-0.1661 -0.5648,-0.5098 -0.5648,-0.9032 0,-0.1418 0.0359,-0.2902 0.0902,-0.4093 0.3543,-1.027 -0.2274,-2.1411 -3.1266,-2.777 -4.2976,-0.9449 -7.0113,-5.3781 -8.5629,-6.8531 -1.8234,-1.7289 -6.9726,-2.7949 -6.1976,-1.7629 0.6066,0.807 2.923,3.325 4.3328,6.0449 1.2605,2.4293 2.3832,3.1223 3.9297,5.441 0.4527,0.6817 2.2121,3.0723 2.7242,4.9617 0.5742,1.8469 0.3805,4.1614 0.6012,5.1164 0.3164,1.3739 1.614,4.3594 1.7117,6.043 0.0566,0.952 -3.9793,-1.3574 -5.8938,-1.3574 -1.9136,0 -3.7793,1.1434 -5.4898,1.2266 -2.1176,0.1015 -3.4777,-1.6321 -5.3938,-1.3293 -1.0925,0.175 -2.0144,1.1367 -3.9261,1.2089 -2.7219,0.1008 -6.0477,-1.5117 -12.2942,-1.3105 -6.1437,0.1973 -11.8199,7.7629 -12.5941,8.966 -0.9078,1.4129 -2.0164,1.4129 -3.2242,0.3016 -1.2106,-1.1043 -2.7,-0.2352 -3.1242,0.507 -0.8059,1.4102 -2.9606,5.5332 -6.2981,6.3965 -4.6152,1.198 -6.9519,-2.5547 -6.6484,-5.5391 0.3078,-3.0293 2.266,-3.8789 3.1738,-5.4894 0.9059,-1.6121 1.3699,-2.6551 3.0769,-3.368 1.209,-0.5012 1.6594,-1.2492 1.2997,-2.2422 -0.3161,-0.8644 -1.5747,-1.0625 -2.4016,-1.1027 -1.7582,-0.0828 -2.991,0.3937 -3.8898,0.9699 -1.0457,0.6641 -1.8961,1.5899 -2.8083,3.1621 -1.0558,1.7344 -2.7187,2.4891 -4.6558,2.4891 -0.9231,0 -1.7871,-0.2449 -2.5547,-0.6387 -3.0355,-1.5789 -6.6492,-2.5164 -10.54023,-2.5164 l -4.3875,0 C 133.15742,374.0189 132,380.8029 132,387.8568 c 0,34.8492 28.25,63.0971 63.098,63.0971 34.8485,0 63.096,-28.2479 63.096,-63.0971 0,-12.6465 -3.719,-24.4211 -10.125,-34.298"
           inkscape:connector-curvature="0" />
        <path
           id="path10911-6"
           style="fill:#100f0d;fill-opacity:1;fill-rule:nonzero;stroke:none"
           d="m 208.9949,359.3459 c 0.3239,-0.3152 0.8836,-1.3828 0.1989,-2.7324 -0.3829,-0.7168 -0.7958,-1.2196 -1.534,-1.8086 -0.8871,-0.7129 -2.6227,-1.5332 -5.002,-0.0254 -1.2777,0.8117 -1.3566,1.0851 -3.1226,0.8566 -1.2622,-0.166 -1.7637,1.1074 -1.311,2.168 0.4543,1.0547 2.3192,1.9109 4.6356,0.5516 1.0429,-0.6114 2.6683,-1.9071 4.0922,-0.7598 0.5894,0.4726 0.9425,0.7871 1.7609,1.7363 0.0383,0.0383 0.0898,0.0617 0.1476,0.0617 0.0512,0 0.0985,-0.0195 0.1344,-0.048"
           inkscape:connector-curvature="0" />
        <path
           id="path10913-3"
           style="fill:#cd1e25;fill-opacity:1;fill-rule:nonzero;stroke:none"
           d="m 230.7043,404.6447 c -0.625,-2.0965 -1.5105,-4.7766 -5.4559,-6.8016 -0.575,-0.2949 -0.7941,0.1883 -0.5293,0.6415 1.4914,2.5359 1.7559,3.1699 2.1895,4.1699 0.6066,1.4629 0.9238,3.5441 -0.282,7.8828 -2.3727,8.5394 -7.3235,19.9536 -10.9219,23.6566 -3.4719,3.574 -9.7645,4.579 -15.4508,3.12 -2.0945,-0.537 -6.1926,-2.668 -13.791,-0.957 -13.1524,2.962 -15.1008,-3.623 -15.8539,-6.49 -0.7567,-2.871 -2.568,-11.0238 -2.568,-11.0238 -0.6047,-3.3222 -1.3949,-9.0957 19.0258,-12.9863 9.5144,-1.8109 9.9969,-4.2695 10.4176,-6.0383 0.7558,-3.1687 1.9625,-4.9832 3.3218,-5.8894 1.3586,-0.9082 0,-1.6582 -1.5082,-1.8117 -4.0519,-0.4207 -19.0261,3.8742 -27.8847,8.9082 -7.2488,4.4293 -7.3695,8.4179 -5.7102,11.8011 -10.948,1.1836 -19.1656,-1.0257 -20.6543,-6.2093 -2.5566,-8.8946 19.5551,-24.0887 44.7348,-31.7137 26.425,-8 53.6034,-2.4141 56.6244,14.1953 1.37,7.5457 -4.985,13.1277 -15.7037,15.5457 z m -32.8602,28.3072 c -0.0105,0 -0.0222,-0.002 -0.0328,-0.002 -0.1133,0 -0.2039,0.087 -0.2039,0.191 0,0.077 0.0469,0.142 0.1149,0.174 1.4132,0.745 3.5211,1.34 5.9336,1.586 0.7242,0.074 1.4316,0.112 2.1129,0.117 0.1195,0 0.2386,0 0.3601,-10e-4 4.0441,-0.092 7.2813,-1.7 7.234,-3.589 -0.0481,-1.893 -3.3641,-3.352 -7.4094,-3.262 -1.309,0.031 -2.5379,0.22 -3.5957,0.525 -0.1242,0.033 -0.2152,0.139 -0.2152,0.265 0,0.126 0.091,0.235 0.2183,0.267 2.5231,0.584 4.2258,1.537 4.1059,2.439 -0.1586,1.195 -3.4586,1.845 -7.3723,1.453 -0.4285,-0.045 -0.8457,-0.099 -1.2504,-0.163 z m -7.657,-12.0427 c -7.2879,-0.5278 -8.0445,-1.3149 -9.4098,-2.7684 -1.925,-2.0504 -4.4609,2.6598 -4.4609,2.6598 -1.5211,0.3199 -3.366,2.7746 -2.3715,5.0653 0.9809,2.265 2.7918,1.586 3.3594,0.881 0.6898,-0.859 2.1641,-2.2651 4.0769,-2.2139 1.9126,0.0504 4.12,0.4519 7.1981,0.4519 3.1187,0 5.2168,-1.1648 5.334,-2.1652 0.1012,-0.8543 -0.2531,-1.6594 -3.7262,-1.9105"
           inkscape:connector-curvature="0" />
      </g>
      <path
         inkscape:connector-curvature="0"
         inkscape:original-d="M -9.9774595,-2.7864532 10.460041,-8.2864535"
         inkscape:path-effect="#path-effect96277"
         id="path96275"
         d="M -9.9774595,-2.7864532 10.460041,-8.2864535"
         style="opacity:0.83127573;fill:none;stroke:#ffffff;stroke-width:1px;stroke-linecap:butt;stroke-linejoin:miter;stroke-opacity:1;display:inline;enable-background:new" />
      <path
         inkscape:connector-curvature="0"
         sodipodi:nodetypes="ccccczc"
         id="path84155"
         d="m 14.306241,-12.030444 c -1.38889,0 -0.0421,0.497088 1.34375,1.125 1.38582,0.627912 4.972881,3.2150525 4.156251,6.8750008 4.32331,-0.430583 6.67913,3.122378 7,4.28124998 0.32087,1.15887202 1,2.60763902 1,1.21875002 0.0283,-3.805581 -2.84543,-6.431701 -4.84375,-8.6562503 -1.99832,-2.224549 -5.002461,-4.3669895 -8.656251,-4.8437505 z"
         style="fill:url(#radialGradient4086);fill-opacity:1;stroke:none;display:inline;enable-background:new" />
      <path
         inkscape:connector-curvature="0"
         sodipodi:nodetypes="ccccc"
         id="path84157"
         d="m 15.407121,-11.016091 c 0.9223,0 3.00844,6.1956628 2.08614,10.3292508 4.294961,-0.427759 8.853381,0.08818 9.312981,0.93764698 -0.32087,-1.15887198 -2.67669,-4.71183298 -7,-4.28124998 0.86466,-3.8752393 -3.186571,-6.6172988 -4.399121,-6.9856478 z"
         style="opacity:0.87854201;fill:url(#linearGradient4088);fill-opacity:1;stroke:none;display:inline;enable-background:new" />
      <g
         style="display:inline;enable-background:new"
         id="g5046"
         clip-path="none"
         transform="matrix(0.33021995,0,0,0.33021995,-28.699168,-29.042523)">
        <path
           style="opacity:0.27983542;fill:none;stroke:#292a29;stroke-width:9.08485413;stroke-linecap:butt;stroke-linejoin:miter;stroke-miterlimit:4;stroke-opacity:1;stroke-dasharray:none"
           d="m 101.98884,60.304267 0,24.620528 c 0,0.62079 -0.25381,1.07471 -0.74943,1.50927 l -5.964272,5.7288 c -0.746005,0.74754 -5.05132,0.95632 -5.950163,0.0556 l -6.159135,-5.83149 c -0.371714,-0.3104 -0.898566,-0.77651 -0.898566,-1.46221 l 0,-37.707774 c -0.219371,-2.41806 1.266417,-3.476471 3.434746,-3.476471 l 17.09147,0 c 2.35418,0 3.31716,1.427836 3.31716,3.476471 l 0,1.298296"
           id="path5048"
           inkscape:connector-curvature="0"
           sodipodi:nodetypes="cccccccccccc" />
        <path
           sodipodi:nodetypes="cccccccccccc"
           inkscape:connector-curvature="0"
           id="path5050"
           d="m 99.139389,60.539297 0,24.240988 c 0,0.625 -0.25606,1.08199 -0.75605,1.51949 l -5.749311,5.76757 c -0.7526,0.7526 -2.040921,0.96279 -2.94771,0.056 l -4.339933,-5.87096 c -0.375,-0.3125 -0.90651,-0.78177 -0.90651,-1.47211 l 0,-38.249944 c -0.221311,-2.434426 1.277613,-3.5 3.465113,-3.5 l 14.187482,0 c 2.375,0 3.34649,1.4375 3.34649,3.5 l 0,2.069279"
           style="fill:none;stroke:#909090;stroke-width:3.02828455;stroke-linecap:butt;stroke-linejoin:miter;stroke-miterlimit:4;stroke-opacity:1;stroke-dasharray:none" />
        <path
           style="fill:none;stroke:#ffffff;stroke-width:3.02828455;stroke-linecap:butt;stroke-linejoin:miter;stroke-miterlimit:4;stroke-opacity:1;stroke-dasharray:none"
           d="m 96.134073,60.580343 0,24.910142 c 0,0.625 -0.256056,1.08199 -0.756056,1.51949 l -5.08016,4.69691 c -0.7526,0.7526 -2.040921,0.96279 -2.94771,0.056 l -5.410594,-4.8003 c -0.375,-0.3125 -0.90651,-0.78177 -0.90651,-1.47211 l 0,-38.249935 c -0.221311,-2.434426 1.277613,-3.5 3.465113,-3.5 l 14.1875,0 c 2.375004,0 3.346494,1.4375 3.346494,3.5 l 0,1.312208"
           id="path5052"
           inkscape:connector-curvature="0"
           sodipodi:nodetypes="cccccccccccc" />
      </g>
    </g>
  </g>
</svg>
